ACCESSION: MSBNK-Fac_Eng_Univ_Tokyo-JP004194
RECORD_TITLE: TETRAETHYLAMMONIUM BROMIDE; EI-B; MS
DATE: 2016.01.19 (Created 2008.10.21, modified 2011.05.06)
AUTHORS: ISA K, DEPT. OF CHEM., FAC. OF EDUC., FUKUI UNIV.
LICENSE: CC BY-NC-SA

CH$NAME: TETRAETHYLAMMONIUM BROMIDE
CH$NAME: N,N,N-TRIETHYLETHANAMINIUM BROMIDE
CH$COMPOUND_CLASS: N/A
CH$FORMULA: C8H20BrN
CH$EXACT_MASS: 209.07791
CH$SMILES: CC[N+](CC)(CC)CC.[Br-]
CH$IUPAC: InChI=1S/C8H20N.BrH/c1-5-9(6-2,7-3)8-4;/h5-8H2,1-4H3;1H/q+1;/p-1
CH$LINK: CAS 71-91-0
CH$LINK: INCHIKEY HWCKGOZZJDHMNC-UHFFFAOYSA-M
CH$LINK: COMPTOX DTXSID9044457

AC$INSTRUMENT: JEOL JMS-01-SG
AC$INSTRUMENT_TYPE: EI-B
AC$MASS_SPECTROMETRY: MS_TYPE MS
AC$MASS_SPECTROMETRY: ION_MODE POSITIVE
AC$MASS_SPECTROMETRY: IONIZATION_ENERGY 15 eV

MS$FOCUSED_ION: ION_TYPE [M]+*

PK$SPLASH: splash10-000l-9000000000-6fbed990b260fcc51703
PK$NUM_PEAK: 14
PK$PEAK: m/z int. rel.int.
  29 28 280
  42 32 320
  44 28 280
  56 0.38 4
  58 28 280
  70 14 140
  72 14 140
  79 0.64 6
  80 3.4 34
  86 99.99 999
  100 2.6 26
  101 0.03 0
  108 2.8 28
  130 1.4 14