ACCESSION: MSBNK-Fac_Eng_Univ_Tokyo-JP004284
RECORD_TITLE: NAPHTHALENE; EI-B; MS
DATE: 2016.01.19 (Created 2008.10.21, modified 2011.05.06)
AUTHORS: TAJIMA S, GUNMA COLLEGE OF TECHNOLOGY
LICENSE: CC BY-NC-SA

CH$NAME: NAPHTHALENE
CH$COMPOUND_CLASS: N/A
CH$FORMULA: C10H8
CH$EXACT_MASS: 128.06260
CH$SMILES: c(c2)cc(c1)c(c2)ccc1
CH$IUPAC: InChI=1S/C10H8/c1-2-6-10-8-4-3-7-9(10)5-1/h1-8H
CH$LINK: CAS 91-20-3
CH$LINK: INCHIKEY UFWIBTONFRDIAS-UHFFFAOYSA-N
CH$LINK: COMPTOX DTXSID8020913

AC$INSTRUMENT: HITACHI RMU-7M
AC$INSTRUMENT_TYPE: EI-B
AC$MASS_SPECTROMETRY: MS_TYPE MS
AC$MASS_SPECTROMETRY: ION_MODE POSITIVE
AC$MASS_SPECTROMETRY: IONIZATION_ENERGY 70 eV

MS$FOCUSED_ION: ION_TYPE [M]+*

PK$SPLASH: splash10-004i-5900000000-262e4b8e72f3d3fa0593
PK$NUM_PEAK: 30
PK$PEAK: m/z int. rel.int.
  27 1 10
  37 1.19 12
  38 1.66 17
  39 4.12 41
  50 8.32 83
  51 10.3 103
  52 2.22 22
  61 1.98 20
  62 4.12 41
  63 7.84 78
  64 3.17 32
  73 1.27 13
  74 8.56 86
  75 8.48 85
  76 6.26 63
  77 5.39 54
  78 4.36 44
  86 1.66 17
  87 2.77 28
  89 1.58 16
  98 2.77 28
  99 1.58 16
  100 1.58 16
  101 3.41 34
  102 16.56 166
  103 1.51 15
  126 7.37 74
  127 12.68 127
  128 99.99 999
  129 11.09 111