ACCESSION: MSBNK-Fac_Eng_Univ_Tokyo-JP004395
RECORD_TITLE: 1,2-DIMETHYL-8-NITROPYRROLO(3,2-F)QUINOLINE; EI-B; MS
DATE: 2016.01.19 (Created 2008.10.21, modified 2011.05.06)
AUTHORS: SASAKI S, TOYOHASHI UNIV. OF TECH.
LICENSE: CC BY-NC-SA

CH$NAME: 1,2-DIMETHYL-8-NITROPYRROLO(3,2-F)QUINOLINE
CH$COMPOUND_CLASS: N/A
CH$FORMULA: C13H11N3O2
CH$EXACT_MASS: 241.08513
CH$SMILES: CC1=C(NC2=C1C3=CC(=CN=C3C=C2)[N+](=O)[O-])C
CH$IUPAC: InChI=1S/C13H11N3O2/c1-7-8(2)15-12-4-3-11-10(13(7)12)5-9(6-14-11)16(17)18/h3-6,15H,1-2H3
CH$LINK: INCHIKEY MLMAMEHPDWJUPS-UHFFFAOYSA-N

AC$INSTRUMENT: Unknown
AC$INSTRUMENT_TYPE: EI-B
AC$MASS_SPECTROMETRY: MS_TYPE MS
AC$MASS_SPECTROMETRY: ION_MODE POSITIVE
AC$MASS_SPECTROMETRY: IONIZATION_ENERGY 50 eV

MS$FOCUSED_ION: ION_TYPE [M]+*

PK$SPLASH: splash10-0007-6980000000-1206db09a2eeabd3248f
PK$NUM_PEAK: 43
PK$PEAK: m/z int. rel.int.
  56 4.6 46
  57 22.2 222
  67 5.1 51
  68 0.51 5
  69 15.6 156
  70 3.6 36
  71 9.3 93
  81 0.62 6
  82 3.1 31
  83 10.3 103
  84 3.1 31
  85 0.46 5
  90 4.6 46
  95 5.1 51
  96 3.1 31
  97 1.03 10
  98 2.6 26
  109 2.3 23
  111 3.1 31
  115 0.31 3
  126 3.1 31
  127 4.6 46
  139 2.6 26
  140 0.26 3
  151 3.6 36
  153 4.6 46
  154 3.1 31
  166 0.31 3
  167 8.2 82
  168 7.2 72
  179 5.1 51
  180 0.23 2
  183 6.2 62
  192 2.3 23
  193 8.2 82
  194 1.03 10
  195 59 590
  196 5.1 51
  211 3.1 31
  226 0.23 2
  240 6.7 67
  241 99.99 999
  242 9.2 92