ACCESSION: MSBNK-Fac_Eng_Univ_Tokyo-JP004526
RECORD_TITLE: TETRAETHYLAMMONIUM IODIDE; EI-B; MS
DATE: 2016.01.19 (Created 2008.10.21, modified 2011.05.06)
AUTHORS: ISA K, DEPT. OF CHEM., FAC. OF EDUC., FUKUI UNIV.
LICENSE: CC BY-NC-SA

CH$NAME: TETRAETHYLAMMONIUM IODIDE
CH$COMPOUND_CLASS: N/A
CH$FORMULA: C8H20IN
CH$EXACT_MASS: 257.06404
CH$SMILES: CC[N+](CC)(CC)CC.[I-]
CH$IUPAC: InChI=1S/C8H20N.HI/c1-5-9(6-2,7-3)8-4;/h5-8H2,1-4H3;1H/q+1;/p-1
CH$LINK: INCHIKEY UQFSVBXCNGCBBW-UHFFFAOYSA-M
CH$LINK: COMPTOX DTXSID80883217

AC$INSTRUMENT: JEOL JMS-01-SG
AC$INSTRUMENT_TYPE: EI-B
AC$MASS_SPECTROMETRY: MS_TYPE MS
AC$MASS_SPECTROMETRY: ION_MODE POSITIVE
AC$MASS_SPECTROMETRY: IONIZATION_ENERGY 15 eV

MS$FOCUSED_ION: ION_TYPE [M]+*

PK$SPLASH: splash10-0570-9400000000-6ad76d8b9d4eb9e9e3a7
PK$NUM_PEAK: 15
PK$PEAK: m/z int. rel.int.
  29 99.99 999
  56 24 240
  58 74 740
  70 0.75 8
  72 9.7 97
  86 99 990
  87 7.5 75
  100 0.65 7
  101 11 110
  102 1.3 13
  127 73 730
  128 0.86 9
  130 4.3 43
  156 51 510
  254 0.2 2