ACCESSION: MSBNK-Fac_Eng_Univ_Tokyo-JP004556
RECORD_TITLE: O-TRIMETHYLSILYL-N-DI-TRIMETHYLSILYLAMINOETHANOL; EI-B; MS
DATE: 2016.01.19 (Created 2008.10.21, modified 2011.05.06)
AUTHORS: HAYASHI A, DEPT. OF CHEMISTRY, FAC. OF SCI. AND TECHNOLOGY, KINKI UNIV.
LICENSE: CC BY-NC-SA

CH$NAME: O-TRIMETHYLSILYL-N-DI-TRIMETHYLSILYLAMINOETHANOL
CH$COMPOUND_CLASS: N/A
CH$FORMULA: C11H31OSi3
CH$EXACT_MASS: 263.16827
CH$SMILES: N/A
CH$IUPAC: N/A

AC$INSTRUMENT: SHIMADZU LKB-9000B
AC$INSTRUMENT_TYPE: EI-B
AC$MASS_SPECTROMETRY: MS_TYPE MS
AC$MASS_SPECTROMETRY: ION_MODE POSITIVE
AC$MASS_SPECTROMETRY: IONIZATION_ENERGY 70 eV

MS$FOCUSED_ION: ION_TYPE [M]+*

PK$SPLASH: splash10-00di-2900000000-b21c9d2a9d8b8c852ff5
PK$NUM_PEAK: 80
PK$PEAK: m/z int. rel.int.
  55 0.1 1
  56 0.2 2
  57 0.3 3
  58 0.08 1
  59 8.4 84
  60 0.7 7
  61 0.4 4
  66 0.03 0
  70 0.2 2
  71 0.3 3
  72 0.9 9
  73 4.89 49
  74 4.3 43
  75 4 40
  76 0.2 2
  77 0.01 0
  81 0.1 1
  85 0.2 2
  86 16.4 164
  87 0.12 1
  88 0.8 8
  89 0.4 4
  90 0.1 1
  95 0.01 0
  97 0.1 1
  98 0.1 1
  99 0.2 2
  100 1.75 18
  101 2.1 21
  102 1.8 18
  103 0.7 7
  104 0.01 0
  105 0.2 2
  113 0.2 2
  114 2.8 28
  115 0.07 1
  116 1.1 11
  117 1.3 13
  118 0.1 1
  119 0.07 1
  129 0.3 3
  130 4 40
  131 2.8 28
  132 0.08 1
  133 6.2 62
  134 0.9 9
  135 0.5 5
  142 0.01 0
  144 0.4 4
  145 0.2 2
  146 0.6 6
  147 2.24 22
  148 3.5 35
  149 1.7 17
  150 0.1 1
  158 0.08 1
  159 0.2 2
  160 0.1 1
  171 0.1 1
  172 0.17 2
  173 1 10
  174 99.99 999
  175 28.8 288
  176 1.27 13
  177 1.6 16
  178 0.2 2
  187 0.1 1
  188 0.12 1
  189 0.2 2
  190 0.3 3
  191 0.2 2
  204 0.04 0
  205 0.1 1
  246 0.1 1
  262 6.8 68
  263 0.17 2
  264 0.9 9
  265 0.1 1
  276 0.1 1
  277 0.1 1