ACCESSION: MSBNK-Fac_Eng_Univ_Tokyo-JP004611
RECORD_TITLE: 1,1-ETHYLENEDIOXY-5-HYDROXY-5-METHYL-4-PHENYLSULFOXYHEXANE; EI-B; MS
DATE: 2016.01.19 (Created 2008.10.21, modified 2011.05.06)
AUTHORS: KATO T, DEPT. OF CHEM., FAC. OF SCI., TOHOKU UNIV.
LICENSE: CC BY-NC-SA

CH$NAME: 1,1-ETHYLENEDIOXY-5-HYDROXY-5-METHYL-4-PHENYLSULFOXYHEXANE
CH$COMPOUND_CLASS: N/A
CH$FORMULA: C15H22O4S
CH$EXACT_MASS: 298.12388
CH$SMILES: N/A
CH$IUPAC: N/A

AC$INSTRUMENT: Unknown
AC$INSTRUMENT_TYPE: EI-B
AC$MASS_SPECTROMETRY: MS_TYPE MS
AC$MASS_SPECTROMETRY: ION_MODE POSITIVE
AC$MASS_SPECTROMETRY: IONIZATION_ENERGY 25 eV

MS$FOCUSED_ION: ION_TYPE [M]+*

PK$SPLASH: splash10-0hki-9600000000-2501d22eb2290436486f
PK$NUM_PEAK: 89
PK$PEAK: m/z int. rel.int.
  15 3 30
  17 1.7 17
  18 67.3 673
  28 99.99 999
  29 2.7 27
  30 1.6 16
  31 1.5 15
  32 1.39 14
  39 1.6 16
  41 9.3 93
  43 42.3 423
  44 0.22 2
  45 31.4 314
  51 2 20
  55 5 50
  56 0.32 3
  57 22.9 229
  58 4.5 45
  59 11 110
  61 0.15 2
  65 1.2 12
  66 13.4 134
  67 1.7 17
  69 1.96 20
  70 1 10
  71 7.4 74
  72 1 10
  73 6.23 62
  74 6.2 62
  77 8.4 84
  78 5.8 58
  79 0.18 2
  81 1.5 15
  82 5 50
  83 9.8 98
  84 0.21 2
  85 22.4 224
  86 10.2 102
  87 2.4 24
  88 0.36 4
  91 7.2 72
  92 1.3 13
  93 1.5 15
  94 0.21 2
  95 7.2 72
  97 2.2 22
  99 7 70
  100 0.23 2
  101 71.5 715
  102 1.6 16
  103 1 10
  108 0.15 2
  109 3.9 39
  110 35.7 357
  111 37.7 377
  112 0.18 2
  113 10.7 107
  114 3.4 34
  115 3 30
  116 0.12 1
  117 7.9 79
  118 1.2 12
  125 5 50
  126 0.63 6
  127 1.6 16
  128 2 20
  129 3.7 37
  135 1.34 13
  136 63.3 633
  137 3.7 37
  138 3.2 32
  139 0.26 3
  149 2.4 24
  151 5.2 52
  154 1.3 13
  155 0.78 8
  157 1.9 19
  171 2.1 21
  173 15.6 156
  174 0.39 4
  178 1.6 16
  191 1.1 11
  220 1 10
  222 0.23 2
  223 8 80
  224 8 80
  225 2.1 21
  226 0.1 1
  280 1.3 13