ACCESSION: MSBNK-Fac_Eng_Univ_Tokyo-JP004674
RECORD_TITLE: (2-METHYL-2-PROPENYL)TRIMETHYLSILANE; EI-B; MS
DATE: 2016.01.19 (Created 2008.10.21, modified 2011.05.06)
AUTHORS: MASS SPECTROSCOPY SOC. OF JAPAN (MSSJ)
LICENSE: CC BY-NC-SA

CH$NAME: (2-METHYL-2-PROPENYL)TRIMETHYLSILANE
CH$NAME: 2,4,4-TRIMETHYL-4-SILA-1-PENTENE
CH$COMPOUND_CLASS: N/A
CH$FORMULA: C7H16Si
CH$EXACT_MASS: 128.10213
CH$SMILES: CC(=C)C[Si](C)(C)C
CH$IUPAC: InChI=1S/C7H16Si/c1-7(2)6-8(3,4)5/h1,6H2,2-5H3
CH$LINK: INCHIKEY OWVJMAKUWHECNI-UHFFFAOYSA-N
CH$LINK: COMPTOX DTXSID10349033

AC$INSTRUMENT: JEOL JMS-D-3000
AC$INSTRUMENT_TYPE: EI-B
AC$MASS_SPECTROMETRY: MS_TYPE MS
AC$MASS_SPECTROMETRY: ION_MODE POSITIVE
AC$MASS_SPECTROMETRY: IONIZATION_ENERGY 70 eV

MS$FOCUSED_ION: ION_TYPE [M]+*

PK$SPLASH: splash10-00di-9100000000-900702a6c9e55beb11d1
PK$NUM_PEAK: 10
PK$PEAK: m/z int. rel.int.
  45 5.33 53
  59 9.73 97
  73 99.99 999
  74 7.14 71
  75 3.35 34
  85 6.16 62
  113 11.46 115
  114 1.36 14
  128 10.77 108
  129 1.37 14