ACCESSION: MSBNK-Fac_Eng_Univ_Tokyo-JP004677
RECORD_TITLE: 1,1-DICHLORO-4-PHENYL-1-BUTENE; EI-B; MS
DATE: 2016.01.19 (Created 2008.10.21, modified 2011.05.06)
AUTHORS: MASS SPECTROSCOPY SOC. OF JAPAN (MSSJ)
LICENSE: CC BY-NC-SA

CH$NAME: 1,1-DICHLORO-4-PHENYL-1-BUTENE
CH$COMPOUND_CLASS: N/A
CH$FORMULA: C10H10Cl2
CH$EXACT_MASS: 200.01596
CH$SMILES: ClC(Cl)=CCCc(c1)cccc1
CH$IUPAC: InChI=1S/C10H10Cl2/c11-10(12)8-4-7-9-5-2-1-3-6-9/h1-3,5-6,8H,4,7H2
CH$LINK: INCHIKEY UNJBNXSLPCBXPD-UHFFFAOYSA-N

AC$INSTRUMENT: JEOL JMS-D-3000
AC$INSTRUMENT_TYPE: EI-B
AC$MASS_SPECTROMETRY: MS_TYPE MS
AC$MASS_SPECTROMETRY: ION_MODE POSITIVE
AC$MASS_SPECTROMETRY: IONIZATION_ENERGY 70 eV

MS$FOCUSED_ION: ION_TYPE [M]+*

PK$SPLASH: splash10-0006-9100000000-22d5a9fd6efec5af9480
PK$NUM_PEAK: 21
PK$PEAK: m/z int. rel.int.
  44 1.81 18
  50 1.14 11
  51 3.53 35
  63 2.1 21
  64 1.16 12
  65 7.9 79
  77 1.86 19
  78 1.04 10
  89 1.28 13
  91 99.99 999
  92 7.78 78
  117 1.88 19
  119 1.8 18
  127 1.02 10
  128 1.45 15
  129 1.5 15
  164 2.22 22
  165 4.81 48
  166 1.22 12
  167 1.61 16
  200 1.34 13