ACCESSION: MSBNK-Fac_Eng_Univ_Tokyo-JP004689
RECORD_TITLE: 1,2-BIS(TRIMETHYLSILYL)ETHENE; EI-B; MS
DATE: 2016.01.19 (Created 2008.10.21, modified 2011.05.06)
AUTHORS: MASS SPECTROSCOPY SOC. OF JAPAN (MSSJ)
LICENSE: CC BY-NC-SA

CH$NAME: 1,2-BIS(TRIMETHYLSILYL)ETHENE
CH$COMPOUND_CLASS: N/A
CH$FORMULA: C8H20Si2
CH$EXACT_MASS: 172.11035
CH$SMILES: C[Si](C)(C)C=C[Si](C)(C)C
CH$IUPAC: InChI=1S/C8H20Si2/c1-9(2,3)7-8-10(4,5)6/h7-8H,1-6H3
CH$LINK: INCHIKEY AMGXUPKDZBCKPF-UHFFFAOYSA-N

AC$INSTRUMENT: JEOL JMS-D-3000
AC$INSTRUMENT_TYPE: EI-B
AC$MASS_SPECTROMETRY: MS_TYPE MS
AC$MASS_SPECTROMETRY: ION_MODE POSITIVE
AC$MASS_SPECTROMETRY: IONIZATION_ENERGY 70 eV

MS$FOCUSED_ION: ION_TYPE [M]+*

PK$SPLASH: splash10-00di-9300000000-3cdccd591d0dbabed314
PK$NUM_PEAK: 19
PK$PEAK: m/z int. rel.int.
  43 3.5 35
  45 8.58 86
  58 1.41 14
  59 3.56 36
  71 1.67 17
  73 99.99 999
  74 8.99 90
  75 4 40
  83 4.69 47
  84 1.45 15
  98 3.57 36
  99 17.25 173
  100 2.05 21
  157 28.75 288
  158 5.27 53
  159 2.4 24
  172 22.3 223
  173 4.18 42
  174 1.89 19