ACCESSION: MSBNK-Fac_Eng_Univ_Tokyo-JP004827
RECORD_TITLE: N,N,N',N'-TETRAKIS(TRIMETHYLSILYL)-',4-PHENYLENEDIAMINE; EI-B; MS
DATE: 2016.01.19 (Created 2008.10.21, modified 2011.05.06)
AUTHORS: MASS SPECTROSCOPY SOC. OF JAPAN (MSSJ)
LICENSE: CC BY-NC-SA

CH$NAME: N,N,N',N'-TETRAKIS(TRIMETHYLSILYL)-',4-PHENYLENEDIAMINE
CH$COMPOUND_CLASS: N/A
CH$FORMULA: C18H40N2Si4
CH$EXACT_MASS: 396.22686
CH$SMILES: C[Si](C)(C)N([Si](C)(C)C)c(c1)ccc(c1)N([Si](C)(C)C)[Si](C)(C)C
CH$IUPAC: InChI=1S/C18H40N2Si4/c1-21(2,3)19(22(4,5)6)17-13-15-18(16-14-17)20(23(7,8)9)24(10,11)12/h13-16H,1-12H3
CH$LINK: CAS 25811-68-1
CH$LINK: INCHIKEY XQKWWUIRCYZBMX-UHFFFAOYSA-N
CH$LINK: COMPTOX DTXSID00572838

AC$INSTRUMENT: JEOL JMS-D-3000
AC$INSTRUMENT_TYPE: EI-B
AC$MASS_SPECTROMETRY: MS_TYPE MS
AC$MASS_SPECTROMETRY: ION_MODE POSITIVE
AC$MASS_SPECTROMETRY: IONIZATION_ENERGY 70 eV

MS$FOCUSED_ION: ION_TYPE [M]+*

PK$SPLASH: splash10-001j-1009000000-d86312fd74f6425fabf4
PK$NUM_PEAK: 41
PK$PEAK: m/z int. rel.int.
  45 2.5 25
  59 1.76 18
  73 26.76 268
  74 2.68 27
  75 2.43 24
  100 1.09 11
  130 5.36 54
  131 1.03 10
  183 15.12 151
  184 3.17 32
  194 1.76 18
  206 1.34 13
  208 1.03 10
  220 1.09 11
  234 1.34 13
  235 1.76 18
  266 1.52 15
  277 1.64 16
  291 1.15 12
  292 1.28 13
  293 3.65 37
  294 1.4 14
  309 1.76 18
  324 1.09 11
  335 1.15 12
  349 1.09 11
  365 12.37 124
  366 5.3 53
  367 3.1 31
  368 1.09 11
  379 4.2 42
  381 99.99 999
  382 39.63 396
  383 20.97 210
  384 5.79 58
  385 1.58 16
  396 66.15 662
  397 27.43 274
  398 14.02 140
  399 3.84 38
  400 1.15 12