ACCESSION: MSBNK-Fac_Eng_Univ_Tokyo-JP004832
RECORD_TITLE: 1,2-DI-TERT-BUTYL-1,2-DICHLORO-1,2-DIMETHYLDISILANE; EI-B; MS
DATE: 2016.01.19 (Created 2008.10.21, modified 2011.05.06)
AUTHORS: MASS SPECTROSCOPY SOC. OF JAPAN (MSSJ)
LICENSE: CC BY-NC-SA

CH$NAME: 1,2-DI-TERT-BUTYL-1,2-DICHLORO-1,2-DIMETHYLDISILANE
CH$COMPOUND_CLASS: N/A
CH$FORMULA: C10H24Cl2Si2
CH$EXACT_MASS: 270.07936
CH$SMILES: CC(C)(C)[Si](C)(Cl)[Si](C)(Cl)C(C)(C)C
CH$IUPAC: InChI=1S/C10H24Cl2Si2/c1-9(2,3)13(7,11)14(8,12)10(4,5)6/h1-8H3
CH$LINK: INCHIKEY FRISHBNSKGDUHD-UHFFFAOYSA-N
CH$LINK: COMPTOX DTXSID40521663

AC$INSTRUMENT: JEOL JMS-D-3000
AC$INSTRUMENT_TYPE: EI-B
AC$MASS_SPECTROMETRY: MS_TYPE MS
AC$MASS_SPECTROMETRY: ION_MODE POSITIVE
AC$MASS_SPECTROMETRY: IONIZATION_ENERGY 70 eV

MS$FOCUSED_ION: ION_TYPE [M]+*

PK$SPLASH: splash10-059l-9200000000-fb97bac8f2212d977b10
PK$NUM_PEAK: 64
PK$PEAK: m/z int. rel.int.
  43 15.02 150
  44 1.91 19
  45 3.81 38
  55 1.82 18
  56 4.51 45
  57 36.47 365
  58 15.76 158
  59 32.1 321
  60 2.87 29
  61 1.31 13
  63 6.57 66
  65 5.85 59
  67 1.58 16
  72 10.48 105
  73 86.16 862
  74 7.94 79
  75 6.09 61
  78 2.18 22
  79 6.34 63
  80 1.46 15
  81 2.05 21
  83 1.08 11
  85 99.99 999
  86 10.24 102
  87 3.89 39
  92 1.48 15
  93 83.35 834
  94 6.7 67
  95 30.25 303
  96 2.05 21
  97 1.11 11
  99 3.36 34
  100 48.2 482
  101 6.57 66
  102 1.99 20
  105 8.3 83
  106 1.22 12
  107 2.96 30
  113 1.55 16
  115 1.09 11
  119 10.1 101
  120 5.32 53
  121 4.05 41
  122 1.99 20
  134 6.5 65
  135 10.19 102
  136 3.55 36
  137 4.15 42
  153 1.24 12
  157 2.05 21
  158 1.08 11
  159 1.4 14
  167 1.4 14
  169 1.88 19
  171 1.67 17
  195 1.71 17
  211 1 10
  213 7.7 77
  214 3.91 39
  215 5.56 56
  216 2.7 27
  217 1.36 14
  270 2.46 25
  272 1.69 17