ACCESSION: MSBNK-Fac_Eng_Univ_Tokyo-JP004847
RECORD_TITLE: (2S*,11R*)-2-(4,8,14,15,15-PENTAMETHYLBICYCLO(9,3,1)PENTADECA-4(E),8(E),14-TRIENE)CARBOALDEHYDE; EI-B; MS
DATE: 2016.01.19 (Created 2008.10.21, modified 2011.05.06)
AUTHORS: KATO T, DEPT. OF CHEM., FAC. OF SCI., TOHOKU UNIV.
LICENSE: CC BY-NC-SA

CH$NAME: (2S*,11R*)-2-(4,8,14,15,15-PENTAMETHYLBICYCLO(9,3,1)PENTADECA-4(E),8(E),14-TRIENE)CARBOALDEHYDE
CH$COMPOUND_CLASS: N/A
CH$FORMULA: C21H32O
CH$EXACT_MASS: 300.24532
CH$SMILES: N/A
CH$IUPAC: N/A

AC$INSTRUMENT: Unknown
AC$INSTRUMENT_TYPE: EI-B
AC$MASS_SPECTROMETRY: MS_TYPE MS
AC$MASS_SPECTROMETRY: ION_MODE POSITIVE
AC$MASS_SPECTROMETRY: IONIZATION_ENERGY 25 eV

MS$FOCUSED_ION: ION_TYPE [M]+*

PK$SPLASH: splash10-00dj-2910000000-e9c373807340a2990c70
PK$NUM_PEAK: 90
PK$PEAK: m/z int. rel.int.
  55 16.4 164
  57 4.2 42
  67 17.2 172
  68 0.55 6
  69 49.5 495
  79 7.8 78
  80 8.2 82
  81 4.35 44
  82 3.1 31
  83 13.1 131
  91 14.9 149
  92 0.35 4
  93 50.2 502
  94 20.5 205
  95 83.8 838
  96 1.93 19
  97 6.8 68
  105 28.8 288
  106 9.4 94
  107 5.8 58
  108 54.7 547
  109 64.1 641
  110 14.5 145
  111 0.35 4
  119 39.1 391
  120 21.3 213
  121 76.3 763
  122 4.47 45
  123 83.8 838
  124 48.6 486
  125 9.6 96
  126 0.2 2
  131 18.8 188
  132 2.9 29
  133 42.6 426
  134 2.16 22
  135 44 440
  136 67 670
  137 31.4 314
  138 0.69 7
  143 1 10
  145 26.5 265
  146 7 70
  147 3.94 39
  148 9.4 94
  149 59.7 597
  150 7.9 79
  151 0.27 3
  157 4.7 47
  159 21.9 219
  160 4.4 44
  161 5.14 51
  162 13.9 139
  163 34.4 344
  164 27.4 274
  165 0.66 7
  171 1.6 16
  172 1.8 18
  173 15.4 154
  174 0.12 1
  175 18.8 188
  176 11 110
  177 9.4 94
  187 0.7 7
  188 1.3 13
  189 18.6 186
  190 1.2 12
  191 0.25 3
  200 1.2 12
  201 9.9 99
  202 2.3 23
  203 0.73 7
  204 3.1 31
  213 1.6 16
  215 5.5 55
  217 2.81 28
  218 4 40
  229 3.5 35
  231 16.7 167
  232 0.7 7
  242 1.2 12
  243 1.3 13
  257 10.1 101
  267 0.2 2
  271 99.99 999
  272 20.3 203
  285 30.5 305
  286 0.63 6
  300 41.4 414
  301 9.4 94