ACCESSION: MSBNK-Fac_Eng_Univ_Tokyo-JP004850
RECORD_TITLE: (3S*,4S*)-3-METHOXYMETHYL-4-(2-METHOXY-2-OXOETHYL)CYCLOTETRADECA-7(E),11(E)-DIENYLCARBOXYLATE; EI-B; MS
DATE: 2016.01.19 (Created 2008.10.21, modified 2011.05.06)
AUTHORS: KATO T, DEPT. OF CHEM., FAC. OF SCI., TOHOKU UNIV.
LICENSE: CC BY-NC-SA

CH$NAME: (3S*,4S*)-3-METHOXYMETHYL-4-(2-METHOXY-2-OXOETHYL)CYCLOTETRADECA-7(E),11(E)-DIENYLCARBOXYLATE
CH$COMPOUND_CLASS: N/A
CH$FORMULA: C24H40O6
CH$EXACT_MASS: 424.28249
CH$SMILES: N/A
CH$IUPAC: N/A

AC$INSTRUMENT: Unknown
AC$INSTRUMENT_TYPE: EI-B
AC$MASS_SPECTROMETRY: MS_TYPE MS
AC$MASS_SPECTROMETRY: ION_MODE POSITIVE
AC$MASS_SPECTROMETRY: IONIZATION_ENERGY 14 eV

MS$FOCUSED_ION: ION_TYPE [M]+*

PK$SPLASH: splash10-03di-0009000000-a7b90549185cc86b0784
PK$NUM_PEAK: 23
PK$PEAK: m/z int. rel.int.
  119 4.5 45
  135 8.7 87
  136 6.9 69
  149 0.48 5
  219 6.1 61
  249 6.1 61
  301 5.4 54
  302 0.44 4
  309 9 90
  318 33.1 331
  319 8.7 87
  322 0.5 5
  329 2.9 29
  330 9.5 95
  331 9.6 96
  332 0.64 6
  348 4.1 41
  349 3.3 33
  363 99.99 999
  364 1.95 20
  393 22.3 223
  394 16.8 168
  424 1.2 12