ACCESSION: MSBNK-Fac_Eng_Univ_Tokyo-JP004909
RECORD_TITLE: 1,2-DIBROMOETHANE; EI-B; MS
DATE: 2016.01.19 (Created 2008.10.21, modified 2011.05.06)
AUTHORS: MASS SPECTROSCOPY SOC. OF JAPAN (MSSJ)
LICENSE: CC BY-NC-SA

CH$NAME: 1,2-DIBROMOETHANE
CH$COMPOUND_CLASS: N/A
CH$FORMULA: C2H4Br2
CH$EXACT_MASS: 185.86798
CH$SMILES: BrCCBr
CH$IUPAC: InChI=1S/C2H4Br2/c3-1-2-4/h1-2H2
CH$LINK: CAS 106-93-4
CH$LINK: INCHIKEY PAAZPARNPHGIKF-UHFFFAOYSA-N
CH$LINK: COMPTOX DTXSID3020415

AC$INSTRUMENT: JEOL JMS-D-3000
AC$INSTRUMENT_TYPE: EI-B
AC$MASS_SPECTROMETRY: MS_TYPE MS
AC$MASS_SPECTROMETRY: ION_MODE POSITIVE
AC$MASS_SPECTROMETRY: IONIZATION_ENERGY 70 eV

MS$FOCUSED_ION: ION_TYPE [M]+*

PK$SPLASH: splash10-0a4i-0900000000-2ee3f4bc49d4cb3289c7
PK$NUM_PEAK: 15
PK$PEAK: m/z int. rel.int.
  79 2.79 28
  80 2.67 27
  81 2.84 28
  82 2.61 26
  93 3.93 39
  95 3.58 36
  105 2.64 26
  106 1.89 19
  107 99.99 999
  108 3.45 35
  109 93.7 937
  110 2.03 20
  186 1.72 17
  188 3.06 31
  190 1.59 16