ACCESSION: MSBNK-Fac_Eng_Univ_Tokyo-JP004947
RECORD_TITLE: 1,1-BIS(ETHOXYCARBONYL)CYCLOPROPANE; EI-B; MS
DATE: 2016.01.19 (Created 2008.10.21, modified 2011.05.06)
AUTHORS: MASS SPECTROSCOPY SOC. OF JAPAN (MSSJ)
LICENSE: CC BY-NC-SA

CH$NAME: 1,1-BIS(ETHOXYCARBONYL)CYCLOPROPANE
CH$NAME: DIETHYL 1,1-CYCLOPROPANEDICARBOXYLATE
CH$COMPOUND_CLASS: N/A
CH$FORMULA: C9H14O4
CH$EXACT_MASS: 186.08921
CH$SMILES: CCOC(=O)C(C1)(C1)C(=O)OCC
CH$IUPAC: InChI=1S/C9H14O4/c1-3-12-7(10)9(5-6-9)8(11)13-4-2/h3-6H2,1-2H3
CH$LINK: CAS 1559-02-0
CH$LINK: INCHIKEY KYYUCZOHNYSLFV-UHFFFAOYSA-N
CH$LINK: COMPTOX DTXSID80165984

AC$INSTRUMENT: JEOL JMS-D-3000
AC$INSTRUMENT_TYPE: EI-B
AC$MASS_SPECTROMETRY: MS_TYPE MS
AC$MASS_SPECTROMETRY: ION_MODE POSITIVE
AC$MASS_SPECTROMETRY: IONIZATION_ENERGY 70 eV

MS$FOCUSED_ION: ION_TYPE [M]+*

PK$SPLASH: splash10-03dl-3900000000-fefbdf6273cf8ed7b6ef
PK$NUM_PEAK: 40
PK$PEAK: m/z int. rel.int.
  40 7.7 77
  42 1.77 18
  43 4.75 48
  44 6.1 61
  45 8 80
  53 2.77 28
  54 2.78 28
  55 2.51 25
  57 2.4 24
  59 2.55 26
  67 1.67 17
  68 14.22 142
  69 13.42 134
  70 1.23 12
  71 1.12 11
  82 8.62 86
  83 1.56 16
  84 5.85 59
  85 15.17 152
  86 17.02 170
  87 1.17 12
  95 10.14 101
  96 1.33 13
  97 4.67 47
  99 2.86 29
  111 1.14 11
  112 49.61 496
  113 58.8 588
  114 19.02 190
  127 1.24 12
  130 36.36 364
  131 3.92 39
  140 4.4 44
  141 99.99 999
  142 8.81 88
  143 1.26 13
  158 20.37 204
  159 17.37 174
  160 1.51 15
  186 2.79 28