ACCESSION: MSBNK-Fac_Eng_Univ_Tokyo-JP005008
RECORD_TITLE: (29H,31H-PHTHALOCYANINATO(2-)-N(29),N(30),N(31),N(32))IRON; EI-B; MS
DATE: 2016.01.19 (Created 2008.10.21, modified 2011.05.06)
AUTHORS: ISA K, FUKUI UNIV.
LICENSE: CC BY-NC-SA

CH$NAME: (29H,31H-PHTHALOCYANINATO(2-)-N(29),N(30),N(31),N(32))IRON
CH$NAME: PHTHALOCYANINEIRON(2)
CH$COMPOUND_CLASS: N/A
CH$FORMULA: C32H16FeN8
CH$EXACT_MASS: 568.08473
CH$SMILES: N/A
CH$IUPAC: N/A
CH$LINK: CAS 132-16-1

AC$INSTRUMENT: JEOL JMS-01-SG
AC$INSTRUMENT_TYPE: EI-B
AC$MASS_SPECTROMETRY: MS_TYPE MS
AC$MASS_SPECTROMETRY: ION_MODE POSITIVE
AC$MASS_SPECTROMETRY: IONIZATION_ENERGY 15 eV

MS$FOCUSED_ION: ION_TYPE [M]+*

PK$SPLASH: splash10-014i-0000090000-4e7e33bdceb01ddd579f
PK$NUM_PEAK: 7
PK$PEAK: m/z int. rel.int.
  128 1 10
  184 1 10
  284 1 10
  566 8 80
  568 99.99 999
  569 40 400
  570 11 110