ACCESSION: MSBNK-Fac_Eng_Univ_Tokyo-JP005011
RECORD_TITLE: (29H,31H-PHTHALOCYANINATO(2-)-N(29),N(30),N(31),N(32))ZINC; EI-B; MS
DATE: 2016.01.19 (Created 2008.10.21, modified 2011.05.06)
AUTHORS: ISA K, FUKUI UNIV.
LICENSE: CC BY-NC-SA

CH$NAME: (29H,31H-PHTHALOCYANINATO(2-)-N(29),N(30),N(31),N(32))ZINC
CH$NAME: PHTALOCYANINEZINC(2)
CH$COMPOUND_CLASS: N/A
CH$FORMULA: C32H16N8Zn
CH$EXACT_MASS: 576.07894
CH$SMILES: N/A
CH$IUPAC: N/A
CH$LINK: CAS 14320-04-8

AC$INSTRUMENT: JEOL JMS-01-SG
AC$INSTRUMENT_TYPE: EI-B
AC$MASS_SPECTROMETRY: MS_TYPE MS
AC$MASS_SPECTROMETRY: ION_MODE POSITIVE
AC$MASS_SPECTROMETRY: IONIZATION_ENERGY 15 eV

MS$FOCUSED_ION: ION_TYPE [M]+*

PK$SPLASH: splash10-004i-0000090000-90bfc98aedc5fa74a9a4
PK$NUM_PEAK: 18
PK$PEAK: m/z int. rel.int.
  128 2 20
  192 3 30
  193 1 10
  194 2 20
  195 1 10
  196 2 20
  288 3 30
  288.5 1 10
  289 2 20
  289.5 1 10
  290 2 20
  576 99.99 999
  577 38 380
  578 60 600
  579 33 330
  580 47 470
  581 16 160
  582 5 50