ACCESSION: MSBNK-Fac_Eng_Univ_Tokyo-JP005202
RECORD_TITLE: 2-ETHYLHEXYL ACRYLATE; CI-B; MS
DATE: 2016.01.19 (Created 2008.10.21, modified 2011.05.06)
AUTHORS: YAMAMOTO M, DEP. CHEMISTRY, FAC. SCIENCE, NARA WOMEN'S UNIV.
LICENSE: CC BY-NC-SA

CH$NAME: 2-ETHYLHEXYL ACRYLATE
CH$COMPOUND_CLASS: N/A
CH$FORMULA: C11H20O2
CH$EXACT_MASS: 184.14633
CH$SMILES: CCCCC(CC)COC(=O)C=C
CH$IUPAC: InChI=1S/C11H20O2/c1-4-7-8-10(5-2)9-13-11(12)6-3/h6,10H,3-5,7-9H2,1-2H3
CH$LINK: INCHIKEY GOXQRTZXKQZDDN-UHFFFAOYSA-N
CH$LINK: COMPTOX DTXSID9025297

AC$INSTRUMENT: HITACHI M-80
AC$INSTRUMENT_TYPE: CI-B
AC$MASS_SPECTROMETRY: MS_TYPE MS
AC$MASS_SPECTROMETRY: ION_MODE POSITIVE
AC$MASS_SPECTROMETRY: IONIZATION_ENERGY 20 eV
AC$MASS_SPECTROMETRY: REAGENT_GAS ISOBUTANE

PK$SPLASH: splash10-01p9-0900000000-da18821135eb72f762bd
PK$NUM_PEAK: 11
PK$PEAK: m/z int. rel.int.
  84 2.77 28
  111 3.54 35
  112 6.45 65
  113 72.33 723
  114 8.24 82
  115 7.73 77
  129 1.12 11
  183 0.89 9
  185 99.99 999
  186 12.63 126
  187 1.28 13