ACCESSION: MSBNK-Fac_Eng_Univ_Tokyo-JP005433
RECORD_TITLE: ETHANETHIOL; EI-B; MS
DATE: 2016.01.19 (Created 2008.10.21, modified 2011.05.06)
AUTHORS: TAJIMA S, GUNMA COLLEGE OF TECHNOLOGY
LICENSE: CC BY-NC-SA

CH$NAME: ETHANETHIOL
CH$COMPOUND_CLASS: N/A
CH$FORMULA: C2H6S
CH$EXACT_MASS: 62.01902
CH$SMILES: CCS
CH$IUPAC: InChI=1S/C2H6S/c1-2-3/h3H,2H2,1H3
CH$LINK: INCHIKEY DNJIEGIFACGWOD-UHFFFAOYSA-N
CH$LINK: COMPTOX DTXSID9026394

AC$INSTRUMENT: HITACHI RMU-7M
AC$INSTRUMENT_TYPE: EI-B
AC$MASS_SPECTROMETRY: MS_TYPE MS
AC$MASS_SPECTROMETRY: ION_MODE POSITIVE
AC$MASS_SPECTROMETRY: IONIZATION_ENERGY 70 eV

MS$FOCUSED_ION: ION_TYPE [M]+*

PK$SPLASH: splash10-01t9-9000000000-851df2ea54d45dbde8e4
PK$NUM_PEAK: 18
PK$PEAK: m/z int. rel.int.
  26 9.35 94
  27 48.76 488
  28 23.97 240
  29 79.23 792
  33 3.04 30
  34 14.57 146
  35 12.63 126
  45 14.21 142
  46 11.11 111
  47 61.32 613
  49 2.73 27
  57 5.4 54
  58 7.89 79
  59 6.13 61
  61 14.33 143
  62 99.99 999
  63 17.49 175
  64 4.8 48