ACCESSION: MSBNK-Fac_Eng_Univ_Tokyo-JP005560
RECORD_TITLE: 5-FLUOROURACIL; EI-B; MS
DATE: 2016.01.19 (Created 2008.10.21, modified 2011.05.06)
AUTHORS: MASS SPECTROSCOPY SOC. OF JAPAN (MSSJ)
LICENSE: CC BY-NC-SA

CH$NAME: 5-FLUOROURACIL
CH$COMPOUND_CLASS: N/A
CH$FORMULA: C4H3FN2O2
CH$EXACT_MASS: 130.01786
CH$SMILES: O=C(N1)NC(=O)C(F)=C1
CH$IUPAC: InChI=1S/C4H3FN2O2/c5-2-1-6-4(9)7-3(2)8/h1H,(H2,6,7,8,9)
CH$LINK: INCHIKEY GHASVSINZRGABV-UHFFFAOYSA-N
CH$LINK: COMPTOX DTXSID2020634

AC$INSTRUMENT: JEOL JMS-01-SG-2
AC$INSTRUMENT_TYPE: EI-B
AC$MASS_SPECTROMETRY: MS_TYPE MS
AC$MASS_SPECTROMETRY: ION_MODE POSITIVE
AC$MASS_SPECTROMETRY: IONIZATION_ENERGY 75 eV

MS$FOCUSED_ION: ION_TYPE [M]+*

PK$SPLASH: splash10-001i-9800000000-a3301f9fea9145d07480
PK$NUM_PEAK: 9
PK$PEAK: m/z int. rel.int.
  28 28 280
  29 5 50
  58 9 90
  59 0.13 1
  60 32 320
  87 47 470
  88 9 90
  130 99.99 999
  131 16 160