ACCESSION: MSBNK-Fac_Eng_Univ_Tokyo-JP005571
RECORD_TITLE: 1-(TETRAHYDRO-2-FURANYL)-5-FLUOROURACIL; CI-B; MS
DATE: 2016.01.19 (Created 2008.10.21, modified 2011.05.06)
AUTHORS: MASS SPECTROSCOPY SOC. OF JAPAN (MSSJ)
LICENSE: CC BY-NC-SA

CH$NAME: 1-(TETRAHYDRO-2-FURANYL)-5-FLUOROURACIL
CH$COMPOUND_CLASS: N/A
CH$FORMULA: C8H9FN2O3
CH$EXACT_MASS: 200.05972
CH$SMILES: O=C(N2)C(F)=C([H])N(C(=O)2)C(C1)OCC1
CH$IUPAC: InChI=1S/C8H9FN2O3/c9-5-4-11(6-2-1-3-14-6)8(13)10-7(5)12/h4,6H,1-3H2,(H,10,12,13)
CH$LINK: INCHIKEY WFWLQNSHRPWKFK-UHFFFAOYSA-N
CH$LINK: COMPTOX DTXSID001009966

AC$INSTRUMENT: JEOL JMS-D-300
AC$INSTRUMENT_TYPE: CI-B
AC$MASS_SPECTROMETRY: MS_TYPE MS
AC$MASS_SPECTROMETRY: ION_MODE POSITIVE
AC$MASS_SPECTROMETRY: IONIZATION_ENERGY 200 eV
AC$MASS_SPECTROMETRY: REAGENT_GAS AMMONIA

PK$SPLASH: splash10-014i-0090000000-dc47df1bb362c454d07d
PK$NUM_PEAK: 4
PK$PEAK: m/z int. rel.int.
  200 6 60
  201 6 60
  218 99.99 999
  219 18 180