ACCESSION: MSBNK-Fac_Eng_Univ_Tokyo-JP005607
RECORD_TITLE: 1-(TRANS-4-HYDROXYTETRAHYDRO-2-FURANYL)-5-FLUOROURACIL; CI-B; MS
DATE: 2016.01.19 (Created 2008.10.21, modified 2011.05.06)
AUTHORS: MASS SPECTROSCOPY SOC. OF JAPAN (MSSJ)
LICENSE: CC BY-NC-SA

CH$NAME: 1-(TRANS-4-HYDROXYTETRAHYDRO-2-FURANYL)-5-FLUOROURACIL
CH$COMPOUND_CLASS: N/A
CH$FORMULA: C8H9FN2O4
CH$EXACT_MASS: 216.05463
CH$SMILES: N/A
CH$IUPAC: N/A

AC$INSTRUMENT: JEOL JMS-D-300
AC$INSTRUMENT_TYPE: CI-B
AC$MASS_SPECTROMETRY: MS_TYPE MS
AC$MASS_SPECTROMETRY: ION_MODE POSITIVE
AC$MASS_SPECTROMETRY: IONIZATION_ENERGY 200 eV
AC$MASS_SPECTROMETRY: REAGENT_GAS ISOBUTANE

PK$SPLASH: splash10-014i-0190000000-3d9a4475f6fc53c50537
PK$NUM_PEAK: 6
PK$PEAK: m/z int. rel.int.
  87 1.3 13
  131 11.3 113
  171 2.5 25
  173 0.21 2
  199 1.4 14
  217 99.99 999