ACCESSION: MSBNK-Fac_Eng_Univ_Tokyo-JP005610
RECORD_TITLE: 1-(CIS-4-HYDROXYTETRAHYDRO-2-FURANYL)-5-FLUOROURACIL; CI-B; MS
DATE: 2016.01.19 (Created 2008.10.21, modified 2011.05.06)
AUTHORS: MASS SPECTROSCOPY SOC. OF JAPAN (MSSJ)
LICENSE: CC BY-NC-SA

CH$NAME: 1-(CIS-4-HYDROXYTETRAHYDRO-2-FURANYL)-5-FLUOROURACIL
CH$COMPOUND_CLASS: N/A
CH$FORMULA: C8H9FN2O4
CH$EXACT_MASS: 216.05463
CH$SMILES: N/A
CH$IUPAC: N/A

AC$INSTRUMENT: JEOL JMS-D-300
AC$INSTRUMENT_TYPE: CI-B
AC$MASS_SPECTROMETRY: MS_TYPE MS
AC$MASS_SPECTROMETRY: ION_MODE POSITIVE
AC$MASS_SPECTROMETRY: IONIZATION_ENERGY 200 eV
AC$MASS_SPECTROMETRY: REAGENT_GAS ISOBUTANE

PK$SPLASH: splash10-014i-0290000000-7b6032cefe59b69fe4da
PK$NUM_PEAK: 6
PK$PEAK: m/z int. rel.int.
  87 1.6 16
  131 18.9 189
  171 2.4 24
  173 0.16 2
  199 1 10
  217 99.99 999