ACCESSION: MSBNK-Fac_Eng_Univ_Tokyo-JP005732
RECORD_TITLE: (1R)-(-)-MYRTENOL; EI-B; MS
DATE: 2016.01.19 (Created 2008.10.21, modified 2011.05.06)
AUTHORS: MASS SPECTROSCOPY SOC. OF JAPAN (MSSJ)
LICENSE: CC BY-NC-SA

CH$NAME: (1R)-(-)-MYRTENOL
CH$COMPOUND_CLASS: N/A
CH$FORMULA: C10H16O
CH$EXACT_MASS: 152.12012
CH$SMILES: N/A
CH$IUPAC: N/A
CH$LINK: CAS 515-00-4

AC$INSTRUMENT: HITACHI M-80
AC$INSTRUMENT_TYPE: EI-B
AC$MASS_SPECTROMETRY: MS_TYPE MS
AC$MASS_SPECTROMETRY: ION_MODE POSITIVE
AC$MASS_SPECTROMETRY: IONIZATION_ENERGY 70 eV

MS$FOCUSED_ION: ION_TYPE [M]+*

PK$SPLASH: splash10-004l-9100000000-234a624689f839251b9c
PK$NUM_PEAK: 82
PK$PEAK: m/z int. rel.int.
  14 1.65 17
  15 3.4 34
  16 1.57 16
  17 7.42 74
  18 29.33 293
  19 0.49 5
  26 2.33 23
  27 28.62 286
  28 19.54 195
  29 14.44 144
  30 0.54 5
  31 18.15 182
  32 5.32 53
  37 0.58 6
  38 2.41 24
  39 35.59 356
  40 5.19 52
  41 40.54 405
  42 3.67 37
  43 20.79 208
  44 0.85 9
  45 0.49 5
  50 3.58 36
  51 10.73 107
  52 4.96 50
  53 6.89 69
  54 2.86 29
  55 15.43 154
  56 2.01 20
  57 2.28 23
  58 0.49 5
  59 2.95 30
  62 0.94 9
  63 3.35 34
  64 0.8 8
  65 8.76 88
  66 3.93 39
  67 15.87 159
  68 3.53 35
  69 5.28 53
  70 1.88 19
  71 0.54 5
  74 0.36 4
  75 0.54 5
  76 0.31 3
  77 21.46 215
  78 6.98 70
  79 99.99 999
  80 9.99 100
  81 8.72 87
  82 2.45 25
  83 2.95 30
  84 0.4 4
  85 2.28 23
  89 0.72 7
  90 0.54 5
  91 42 420
  92 9.26 93
  93 16.5 165
  94 2.46 25
  95 4.61 46
  96 2.68 27
  97 0.54 5
  98 0.8 8
  103 2.01 20
  104 0.98 10
  105 7.56 76
  106 3.04 30
  107 6.93 69
  108 22 220
  109 6.17 62
  110 0.85 9
  117 1.52 15
  119 12.57 126
  120 1.39 14
  121 6.53 65
  122 0.67 7
  123 0.45 5
  134 1.34 13
  135 0.4 4
  137 0.65 7
  152 1.48 15