ACCESSION: MSBNK-Fac_Eng_Univ_Tokyo-JP005783
RECORD_TITLE: TRIFLUOPERAZINE; CI-B; MS
DATE: 2016.01.19 (Created 2008.10.21, modified 2011.05.06)
AUTHORS: HAMAMATSU UNIV. SCHOOL OF MEDICINE
LICENSE: CC BY-NC-SA

CH$NAME: TRIFLUOPERAZINE
CH$NAME: 10-(3-(4-METHYL-1-PIPERAZINYL)PROPYL)-2-(TRIFLUOROMETYL)-10H-PHENOTHIAZINE
CH$COMPOUND_CLASS: N/A
CH$FORMULA: C21H24F3N3S
CH$EXACT_MASS: 407.16430
CH$SMILES: CN(C4)CCN(C4)CCCN(c21)c(c3)c(ccc(C(F)(F)F)3)Sc(cccc2)1
CH$IUPAC: InChI=1S/C21H24F3N3S/c1-25-11-13-26(14-12-25)9-4-10-27-17-5-2-3-6-19(17)28-20-8-7-16(15-18(20)27)21(22,23)24/h2-3,5-8,15H,4,9-14H2,1H3
CH$LINK: INCHIKEY ZEWQUBUPAILYHI-UHFFFAOYSA-N
CH$LINK: COMPTOX DTXSID1046928

AC$INSTRUMENT: JEOL JMS-D-300
AC$INSTRUMENT_TYPE: CI-B
AC$MASS_SPECTROMETRY: MS_TYPE MS
AC$MASS_SPECTROMETRY: ION_MODE POSITIVE
AC$MASS_SPECTROMETRY: IONIZATION_ENERGY 200 eV
AC$MASS_SPECTROMETRY: REAGENT_GAS METHANE

PK$SPLASH: splash10-0002-9000100000-e2406a8adccd141c03e7
PK$NUM_PEAK: 9
PK$PEAK: m/z int. rel.int.
  99 99.99 999
  100 4.26 43
  101 6.62 66
  388 2.94 29
  389 1.02 10
  406 2.06 21
  407 2.97 30
  408 5.55 56
  409 1.3 13