ACCESSION: MSBNK-Fac_Eng_Univ_Tokyo-JP005873
RECORD_TITLE: ETYLENEGLYCOL MONOPHENYL ETHER; EI-B; MS
DATE: 2016.01.19 (Created 2008.10.21, modified 2011.05.06)
AUTHORS: YAMAMOTO M, DEP. CHEMISTRY, FAC. SCIENCE, NARA WOMEN'S UNIV.
LICENSE: CC BY-NC-SA

CH$NAME: ETYLENEGLYCOL MONOPHENYL ETHER
CH$COMPOUND_CLASS: N/A
CH$FORMULA: C8H10O2
CH$EXACT_MASS: 138.06808
CH$SMILES: OCCOc(c1)cccc1
CH$IUPAC: InChI=1S/C8H10O2/c9-6-7-10-8-4-2-1-3-5-8/h1-5,9H,6-7H2
CH$LINK: INCHIKEY QCDWFXQBSFUVSP-UHFFFAOYSA-N
CH$LINK: COMPTOX DTXSID9021976

AC$INSTRUMENT: HITACHI RMU-6M
AC$INSTRUMENT_TYPE: EI-B
AC$MASS_SPECTROMETRY: MS_TYPE MS
AC$MASS_SPECTROMETRY: ION_MODE POSITIVE
AC$MASS_SPECTROMETRY: IONIZATION_ENERGY 70 eV

MS$FOCUSED_ION: ION_TYPE [M]+*

PK$SPLASH: splash10-0006-9100000000-7b2a4d4d9b09c7b78741
PK$NUM_PEAK: 30
PK$PEAK: m/z int. rel.int.
  15 1.32 13
  27 5.07 51
  28 3.85 39
  29 2.42 24
  31 1.98 20
  38 2.09 21
  39 9.47 95
  40 2.75 28
  43 2.86 29
  45 10.46 105
  50 7.74 77
  51 11.12 111
  52 1.43 14
  55 1.98 20
  63 2.42 24
  64 1.32 13
  65 7.93 79
  66 10.46 105
  74 1.21 12
  76 1.1 11
  77 25.86 259
  78 3.3 33
  79 3.74 37
  91 1.1 11
  93 1.21 12
  94 99.99 999
  95 14.54 145
  107 6.84 68
  138 31.17 312
  139 2.75 28