ACCESSION: MSBNK-Fac_Eng_Univ_Tokyo-JP005942
RECORD_TITLE: 2-METHYLPIPERIDINE; CI-B; MS
DATE: 2016.01.19 (Created 2008.10.21, modified 2011.05.06)
AUTHORS: YAMAMOTO M, DEP. CHEMISTRY, FAC. SCIENCE, NARA WOMEN'S UNIV.
LICENSE: CC BY-NC-SA

CH$NAME: 2-METHYLPIPERIDINE
CH$COMPOUND_CLASS: N/A
CH$FORMULA: C6H13N
CH$EXACT_MASS: 99.10480
CH$SMILES: CC(C1)NCCC1
CH$IUPAC: InChI=1S/C6H13N/c1-6-4-2-3-5-7-6/h6-7H,2-5H2,1H3
CH$LINK: INCHIKEY NNWUEBIEOFQMSS-UHFFFAOYSA-N
CH$LINK: COMPTOX DTXSID90861728

AC$INSTRUMENT: HITACHI M-80
AC$INSTRUMENT_TYPE: CI-B
AC$MASS_SPECTROMETRY: MS_TYPE MS
AC$MASS_SPECTROMETRY: ION_MODE POSITIVE
AC$MASS_SPECTROMETRY: IONIZATION_ENERGY 100 eV
AC$MASS_SPECTROMETRY: REAGENT_GAS ISOBUTANE

PK$SPLASH: splash10-000j-9000000000-f6cd5eecf7ee9960906d
PK$NUM_PEAK: 7
PK$PEAK: m/z int. rel.int.
  70 5.95 60
  71 3.45 35
  82 1.26 13
  85 99.99 999
  98 23.75 238
  99 26.51 265
  100 11.74 117