ACCESSION: MSBNK-Fac_Eng_Univ_Tokyo-JP006045
RECORD_TITLE: TRIMETHYLOLPROPANE TRIACRYLATE; EI-B; MS
DATE: 2016.01.19 (Created 2008.10.21, modified 2011.05.06)
AUTHORS: HASHIMOTO K, KYOTO COLLEGE OF PHARMACY
LICENSE: CC BY-NC-SA

CH$NAME: TRIMETHYLOLPROPANE TRIACRYLATE
CH$COMPOUND_CLASS: N/A
CH$FORMULA: C15H20O6
CH$EXACT_MASS: 296.12599
CH$SMILES: C=CC(=O)OCC(CC)(COC(=O)C=C)COC(=O)C=C
CH$IUPAC: InChI=1S/C15H20O6/c1-5-12(16)19-9-15(8-4,10-20-13(17)6-2)11-21-14(18)7-3/h5-7H,1-3,8-11H2,4H3
CH$LINK: INCHIKEY DAKWPKUUDNSNPN-UHFFFAOYSA-N
CH$LINK: COMPTOX DTXSID0027773

AC$INSTRUMENT: HITACHI M-80
AC$INSTRUMENT_TYPE: EI-B
AC$MASS_SPECTROMETRY: MS_TYPE MS
AC$MASS_SPECTROMETRY: ION_MODE POSITIVE
AC$MASS_SPECTROMETRY: IONIZATION_ENERGY 20 eV

MS$FOCUSED_ION: ION_TYPE [M]+*

PK$SPLASH: splash10-0a4i-9500000000-dfebfa4f64f207c2f51c
PK$NUM_PEAK: 38
PK$PEAK: m/z int. rel.int.
  55 99.99 999
  56 3.49 35
  67 2.82 28
  68 16.38 164
  69 4.29 43
  70 2.32 23
  73 1.73 17
  80 5.2 52
  81 3 30
  82 3.16 32
  83 2.69 27
  84 1.74 17
  85 2.33 23
  94 1.79 18
  95 3.46 35
  96 4.01 40
  97 7.92 79
  98 4.25 43
  107 1.02 10
  108 1.19 12
  109 1.97 20
  110 1.8 18
  111 1.4 14
  112 1.96 20
  122 1.87 19
  123 4.25 43
  124 8.77 88
  125 1.55 16
  127 15.71 157
  137 2.19 22
  139 5.1 51
  140 20.18 202
  141 1.96 20
  152 17.81 178
  153 2.69 27
  169 6.21 62
  211 2.89 29
  225 1.56 16