ACCESSION: MSBNK-Fac_Eng_Univ_Tokyo-JP006053
RECORD_TITLE: 1,2,4-TRIMETHYLBENZENE; EI-B; MS
DATE: 2016.01.19 (Created 2008.10.21, modified 2011.05.06)
AUTHORS: HASHIMOTO K, KYOTO COLLEGE OF PHARMACY
LICENSE: CC BY-NC-SA

CH$NAME: 1,2,4-TRIMETHYLBENZENE
CH$COMPOUND_CLASS: N/A
CH$FORMULA: C9H12
CH$EXACT_MASS: 120.09390
CH$SMILES: Cc(c1)cc(C)c(C)c1
CH$IUPAC: InChI=1S/C9H12/c1-7-4-5-8(2)9(3)6-7/h4-6H,1-3H3
CH$LINK: INCHIKEY GWHJZXXIDMPWGX-UHFFFAOYSA-N
CH$LINK: COMPTOX DTXSID6021402

AC$INSTRUMENT: HITACHI M-80
AC$INSTRUMENT_TYPE: EI-B
AC$MASS_SPECTROMETRY: MS_TYPE MS
AC$MASS_SPECTROMETRY: ION_MODE POSITIVE
AC$MASS_SPECTROMETRY: IONIZATION_ENERGY 20 eV

MS$FOCUSED_ION: ION_TYPE [M]+*

PK$SPLASH: splash10-0ab9-0900000000-f6eddce0977d81a0a39c
PK$NUM_PEAK: 12
PK$PEAK: m/z int. rel.int.
  77 1.89 19
  79 3.33 33
  91 2.87 29
  92 1 10
  103 1.79 18
  104 1.36 14
  105 99.99 999
  106 8.68 87
  117 1.12 11
  119 12.72 127
  120 96.26 963
  121 9.15 92