ACCESSION: MSBNK-Fac_Eng_Univ_Tokyo-JP006069
RECORD_TITLE: TRIPHENYL PHOSPHITE; EI-B; MS
DATE: 2016.01.19 (Created 2008.10.21, modified 2011.05.06)
AUTHORS: HASHIMOTO K, KYOTO COLLEGE OF PHARMACY
LICENSE: CC BY-NC-SA

CH$NAME: TRIPHENYL PHOSPHITE
CH$COMPOUND_CLASS: N/A
CH$FORMULA: C18H15O3P
CH$EXACT_MASS: 310.07588
CH$SMILES: N/A
CH$IUPAC: N/A

AC$INSTRUMENT: HITACHI M-80
AC$INSTRUMENT_TYPE: EI-B
AC$MASS_SPECTROMETRY: MS_TYPE MS
AC$MASS_SPECTROMETRY: ION_MODE POSITIVE
AC$MASS_SPECTROMETRY: IONIZATION_ENERGY 20 eV

MS$FOCUSED_ION: ION_TYPE [M]+*

PK$SPLASH: splash10-014i-0193000000-a50cc56a0f5824c8f1c8
PK$NUM_PEAK: 13
PK$PEAK: m/z int. rel.int.
  77 8.78 88
  152 2.66 27
  153 8.7 87
  154 2.51 25
  170 3.4 34
  199 4.09 41
  217 99.99 999
  218 13.54 135
  219 1.49 15
  309 8.23 82
  310 34.95 350
  311 6.78 68
  312 1 10