ACCESSION: MSBNK-Fac_Eng_Univ_Tokyo-JP006155
RECORD_TITLE: 1,2-DIETHOXYETHANE; EI-B; MS
DATE: 2016.01.19 (Created 2008.10.21, modified 2011.05.06)
AUTHORS: HASHIMOTO K, KYOTO COLLEGE OF PHARMACY
LICENSE: CC BY-NC-SA

CH$NAME: 1,2-DIETHOXYETHANE
CH$COMPOUND_CLASS: N/A
CH$FORMULA: C6H14O2
CH$EXACT_MASS: 118.09938
CH$SMILES: CCOCCOCC
CH$IUPAC: InChI=1S/C6H14O2/c1-3-7-5-6-8-4-2/h3-6H2,1-2H3
CH$LINK: INCHIKEY LZDKZFUFMNSQCJ-UHFFFAOYSA-N
CH$LINK: COMPTOX DTXSID5025285

AC$INSTRUMENT: HITACHI M-80
AC$INSTRUMENT_TYPE: EI-B
AC$MASS_SPECTROMETRY: MS_TYPE MS
AC$MASS_SPECTROMETRY: ION_MODE POSITIVE
AC$MASS_SPECTROMETRY: IONIZATION_ENERGY 20 eV

MS$FOCUSED_ION: ION_TYPE [M]+*

PK$SPLASH: splash10-053r-9000000000-0befdd686e460e76e561
PK$NUM_PEAK: 20
PK$PEAK: m/z int. rel.int.
  27 4.77 48
  28 3.86 39
  29 34.86 349
  30 1.02 10
  31 99.99 999
  32 1.4 14
  41 5.9 59
  43 7.57 76
  44 4.74 47
  45 47.12 471
  46 1.19 12
  47 3.8 38
  59 62.85 629
  60 2.24 22
  61 1.46 15
  72 2.25 23
  73 6.11 61
  74 23.13 231
  75 1.22 12
  118 0.33 3