ACCESSION: MSBNK-Fac_Eng_Univ_Tokyo-JP006158
RECORD_TITLE: ETHYLENE GLYCOL; EI-B; MS
DATE: 2016.01.19 (Created 2008.10.21, modified 2011.05.06)
AUTHORS: HASHIMOTO K, KYOTO COLLEGE OF PHARMACY
LICENSE: CC BY-NC-SA

CH$NAME: ETHYLENE GLYCOL
CH$COMPOUND_CLASS: N/A
CH$FORMULA: C2H6O2
CH$EXACT_MASS: 62.03678
CH$SMILES: OCCO
CH$IUPAC: InChI=1S/C2H6O2/c3-1-2-4/h3-4H,1-2H2
CH$LINK: INCHIKEY LYCAIKOWRPUZTN-UHFFFAOYSA-N
CH$LINK: COMPTOX DTXSID8020597

AC$INSTRUMENT: HITACHI M-80
AC$INSTRUMENT_TYPE: EI-B
AC$MASS_SPECTROMETRY: MS_TYPE MS
AC$MASS_SPECTROMETRY: ION_MODE POSITIVE
AC$MASS_SPECTROMETRY: IONIZATION_ENERGY 20 eV

MS$FOCUSED_ION: ION_TYPE [M]+*

PK$SPLASH: splash10-001i-9000000000-3f04f129d6a8c819d7bc
PK$NUM_PEAK: 10
PK$PEAK: m/z int. rel.int.
  18 1.73 17
  27 3.63 36
  29 5.77 58
  31 99.99 999
  32 9.55 96
  33 36.07 361
  43 4.89 49
  44 1.26 13
  45 1.03 10
  62 1.71 17