ACCESSION: MSBNK-Fac_Eng_Univ_Tokyo-JP006686
RECORD_TITLE: (2R*,3R*)-2-METHYL-3-((1R*)-1,5-DIMETHYLHEXYL)CYCLOPENTANONE; EI-B; MS
DATE: 2016.01.19 (Created 2008.10.21, modified 2011.05.06)
AUTHORS: MASS SPECTROSCOPY SOC. OF JAPAN (MSSJ)
LICENSE: CC BY-NC-SA

CH$NAME: (2R*,3R*)-2-METHYL-3-((1R*)-1,5-DIMETHYLHEXYL)CYCLOPENTANONE
CH$COMPOUND_CLASS: N/A
CH$FORMULA: C14H26O
CH$EXACT_MASS: 210.19837
CH$SMILES: N/A
CH$IUPAC: N/A

AC$INSTRUMENT: JEOL JMS-D-300
AC$INSTRUMENT_TYPE: EI-B
AC$MASS_SPECTROMETRY: MS_TYPE MS
AC$MASS_SPECTROMETRY: ION_MODE POSITIVE
AC$MASS_SPECTROMETRY: IONIZATION_ENERGY 70 eV

MS$FOCUSED_ION: ION_TYPE [M]+*

PK$SPLASH: splash10-0002-9100000000-d5f19f1aaa947b5eeda6
PK$NUM_PEAK: 37
PK$PEAK: m/z int. rel.int.
  42 8.7 87
  55 8.8 88
  56 4.3 43
  57 1.27 13
  68 1 10
  69 10.9 109
  70 3.5 35
  71 0.88 9
  79 1.3 13
  81 2.6 26
  82 5.6 56
  83 0.74 7
  84 8.9 89
  85 2 20
  93 1.2 12
  95 0.27 3
  96 4.2 42
  97 99.99 999
  98 11.7 117
  99 0.16 2
  107 2.4 24
  108 4.4 44
  109 2.1 21
  110 0.18 2
  111 2.5 25
  121 2.4 24
  122 1.6 16
  123 0.25 3
  124 1.1 11
  125 8.3 83
  126 3.2 32
  137 0.1 1
  139 2.5 25
  140 1.9 19
  195 1.3 13
  210 0.8 8
  211 1.5 15