ACCESSION: MSBNK-Fac_Eng_Univ_Tokyo-JP006714
RECORD_TITLE: N-(4-METHOXYPHENYLACETYL)PIPERIDIN-2-ONE; EI-B; MS
DATE: 2016.01.19 (Created 2008.10.21, modified 2011.05.06)
AUTHORS: MASS SPECTROSCOPY SOC. OF JAPAN (MSSJ)
LICENSE: CC BY-NC-SA

CH$NAME: N-(4-METHOXYPHENYLACETYL)PIPERIDIN-2-ONE
CH$COMPOUND_CLASS: N/A
CH$FORMULA: C14H17NO3
CH$EXACT_MASS: 247.12084
CH$SMILES: COc(c2)ccc(c2)CC(=O)N(C1)C(=O)CCC1
CH$IUPAC: InChI=1S/C14H17NO3/c1-18-12-7-5-11(6-8-12)10-14(17)15-9-3-2-4-13(15)16/h5-8H,2-4,9-10H2,1H3
CH$LINK: INCHIKEY NNLWVOZTPMGCEP-UHFFFAOYSA-N

AC$INSTRUMENT: HITACHI RMU-6G
AC$INSTRUMENT_TYPE: EI-B
AC$MASS_SPECTROMETRY: MS_TYPE MS
AC$MASS_SPECTROMETRY: ION_MODE POSITIVE
AC$MASS_SPECTROMETRY: IONIZATION_ENERGY 20 eV

MS$FOCUSED_ION: ION_TYPE [M]+*

PK$SPLASH: splash10-0002-0900000000-f27bca869fecf047323d
PK$NUM_PEAK: 9
PK$PEAK: m/z int. rel.int.
  55 5 50
  91 5 50
  100 3 30
  120 25 250
  121 17 170
  148 99.99 999
  149 14 140
  247 10 100
  248 2 20