ACCESSION: MSBNK-Fac_Eng_Univ_Tokyo-JP006743
RECORD_TITLE: N-(3-PHENYLPROPIONYL)PYRROLIDIN-2-ONE; EI-B; MS
DATE: 2016.01.19 (Created 2008.10.21, modified 2011.05.06)
AUTHORS: MASS SPECTROSCOPY SOC. OF JAPAN (MSSJ)
LICENSE: CC BY-NC-SA

CH$NAME: N-(3-PHENYLPROPIONYL)PYRROLIDIN-2-ONE
CH$COMPOUND_CLASS: N/A
CH$FORMULA: C13H15NO2
CH$EXACT_MASS: 217.11028
CH$SMILES: O=C(C2)N(CC2)C(=O)CCc(c1)cccc1
CH$IUPAC: InChI=1S/C13H15NO2/c15-12-7-4-10-14(12)13(16)9-8-11-5-2-1-3-6-11/h1-3,5-6H,4,7-10H2
CH$LINK: INCHIKEY QSQPBTLPJIDITH-UHFFFAOYSA-N

AC$INSTRUMENT: HITACHI RMU-6G
AC$INSTRUMENT_TYPE: EI-B
AC$MASS_SPECTROMETRY: MS_TYPE MS
AC$MASS_SPECTROMETRY: ION_MODE POSITIVE
AC$MASS_SPECTROMETRY: IONIZATION_ENERGY 20 eV

MS$FOCUSED_ION: ION_TYPE [M]+*

PK$SPLASH: splash10-0f79-9720000000-e7d92cc442707b4df78c
PK$NUM_PEAK: 41
PK$PEAK: m/z int. rel.int.
  41 1.8 18
  42 1.2 12
  43 3 30
  55 1.2 12
  56 1.4 14
  57 1.7 17
  58 1.5 15
  69 2.2 22
  70 1.5 15
  77 1 10
  78 3 30
  79 2.2 22
  84 4 40
  85 9 90
  86 99.99 999
  87 5 50
  91 20 200
  92 2.2 22
  98 18 180
  99 1.6 16
  100 0.8 8
  103 3.5 35
  104 84 840
  105 19 190
  106 1.5 15
  107 1 10
  112 1 10
  131 10 100
  132 13 130
  133 2.7 27
  150 2.6 26
  160 5 50
  161 3 30
  170 1 10
  174 0.7 7
  178 0.7 7
  189 1.3 13
  199 1.2 12
  217 48 480
  218 8 80
  219 1 10