ACCESSION: MSBNK-Fac_Eng_Univ_Tokyo-JP006794
RECORD_TITLE: CIS-STILBENE; EI-B; MS
DATE: 2016.01.19 (Created 2008.10.21, modified 2011.05.06)
AUTHORS: TAJIMA S, GUNMA COLLEGE OF TECHNOLOGY
LICENSE: CC BY-NC-SA

CH$NAME: CIS-STILBENE
CH$NAME: CIS-1,2-DIPHENYLETHYLENE
CH$COMPOUND_CLASS: N/A
CH$FORMULA: C14H12
CH$EXACT_MASS: 180.09390
CH$SMILES: c(c2)ccc(c2)C=Cc(c1)cccc1
CH$IUPAC: InChI=1S/C14H12/c1-3-7-13(8-4-1)11-12-14-9-5-2-6-10-14/h1-12H/b12-11-
CH$LINK: INCHIKEY PJANXHGTPQOBST-QXMHVHEDSA-N
CH$LINK: COMPTOX DTXSID5026049

AC$INSTRUMENT: HITACHI RMU-7M
AC$INSTRUMENT_TYPE: EI-B
AC$MASS_SPECTROMETRY: MS_TYPE MS
AC$MASS_SPECTROMETRY: ION_MODE POSITIVE
AC$MASS_SPECTROMETRY: IONIZATION_ENERGY 70 eV

MS$FOCUSED_ION: ION_TYPE [M]+*

PK$SPLASH: splash10-0059-3900000000-cf2213304d2bfe988979
PK$NUM_PEAK: 41
PK$PEAK: m/z int. rel.int.
  39 8.33 83
  50 2.07 21
  51 6.2 62
  52 2.52 25
  62 4.07 41
  63 12.79 128
  64 1.94 19
  65 3.49 35
  74 5.49 55
  75 6.85 69
  76 16.15 162
  77 12.21 122
  78 5.49 55
  82.5 2.07 21
  86 1.29 13
  87 2.33 23
  88 2.97 30
  89 13.76 138
  89.5 1.87 19
  90 2.71 27
  102 13.89 139
  103 3.94 39
  115 4.72 47
  126 1.55 16
  127 1.36 14
  128 1.74 17
  129 1.29 13
  130 4.39 44
  139 2.52 25
  148 1.94 19
  151 3.55 36
  152 8.53 85
  153 2.45 25
  165 30.1 301
  166 3.88 39
  176 3.88 39
  177 3.23 32
  178 32.88 329
  179 60.08 601
  180 99.99 999
  181 14.41 144