ACCESSION: MSBNK-Fac_Eng_Univ_Tokyo-JP006795
RECORD_TITLE: CYCLOPENTANE; EI-B; MS
DATE: 2016.01.19 (Created 2008.10.21, modified 2011.05.06)
AUTHORS: TAJIMA S, GUNMA COLLEGE OF TECHNOLOGY
LICENSE: CC BY-NC-SA

CH$NAME: CYCLOPENTANE
CH$COMPOUND_CLASS: N/A
CH$FORMULA: C5H10
CH$EXACT_MASS: 70.07825
CH$SMILES: C(C1)CCC1
CH$IUPAC: InChI=1S/C5H10/c1-2-4-5-3-1/h1-5H2
CH$LINK: INCHIKEY RGSFGYAAUTVSQA-UHFFFAOYSA-N
CH$LINK: COMPTOX DTXSID6024886

AC$INSTRUMENT: HITACHI RMU-7M
AC$INSTRUMENT_TYPE: EI-B
AC$MASS_SPECTROMETRY: MS_TYPE MS
AC$MASS_SPECTROMETRY: ION_MODE POSITIVE
AC$MASS_SPECTROMETRY: IONIZATION_ENERGY 70 eV

MS$FOCUSED_ION: ION_TYPE [M]+*

PK$SPLASH: splash10-0006-9000000000-afc524518acc7d17794e
PK$NUM_PEAK: 17
PK$PEAK: m/z int. rel.int.
  27 4.98 50
  28 1.35 14
  29 2.92 29
  39 10.68 107
  40 4.2 42
  41 22.06 221
  42 99.99 999
  43 4.63 46
  53 1.42 14
  54 1.07 11
  55 35.66 357
  56 1.57 16
  67 1.42 14
  68 1.57 16
  69 3.56 36
  70 25.98 260
  71 1.71 17