ACCESSION: MSBNK-Fac_Eng_Univ_Tokyo-JP007448
RECORD_TITLE: 2-METHOXYETHANOL; CI-B; MS
DATE: 2016.01.19 (Created 2008.10.21, modified 2011.05.06)
AUTHORS: YAMAMOTO M, DEP. CHEMISTRY, FAC. SCIENCE, NARA WOMEN'S UNIV.
LICENSE: CC BY-NC-SA

CH$NAME: 2-METHOXYETHANOL
CH$NAME: METHYL CELLOSOLVE
CH$COMPOUND_CLASS: N/A
CH$FORMULA: C3H8O2
CH$EXACT_MASS: 76.05243
CH$SMILES: COCCO
CH$IUPAC: InChI=1S/C3H8O2/c1-5-3-2-4/h4H,2-3H2,1H3
CH$LINK: CAS 109-86-4
CH$LINK: INCHIKEY XNWFRZJHXBZDAG-UHFFFAOYSA-N
CH$LINK: COMPTOX DTXSID5024182

AC$INSTRUMENT: HITACHI M-80
AC$INSTRUMENT_TYPE: CI-B
AC$MASS_SPECTROMETRY: MS_TYPE MS
AC$MASS_SPECTROMETRY: ION_MODE POSITIVE
AC$MASS_SPECTROMETRY: IONIZATION_ENERGY 70 eV
AC$MASS_SPECTROMETRY: REAGENT_GAS ISOBUTANE

PK$SPLASH: splash10-004i-9000000000-978bfd3de8a59f346a55
PK$NUM_PEAK: 8
PK$PEAK: m/z int. rel.int.
  73 1.35 14
  75 3.26 33
  76 2 20
  77 99.99 999
  78 5.47 55
  79 2.25 23
  85 0.8 8
  99 1.92 19