ACCESSION: MSBNK-Fac_Eng_Univ_Tokyo-JP007846
RECORD_TITLE: 3-ETHYLPYRIDINE; EI-B; MS
DATE: 2016.01.19 (Created 2008.10.21, modified 2011.05.06)
AUTHORS: HASHIMOTO K, KYOTO COLLEGE OF PHARMACY
LICENSE: CC BY-NC-SA

CH$NAME: 3-ETHYLPYRIDINE
CH$COMPOUND_CLASS: N/A
CH$FORMULA: C7H9N
CH$EXACT_MASS: 107.07350
CH$SMILES: CCc(c1)cncc1
CH$IUPAC: InChI=1S/C7H9N/c1-2-7-4-3-5-8-6-7/h3-6H,2H2,1H3
CH$LINK: CAS 536-78-7
CH$LINK: COMPTOX DTXSID6060212
CH$LINK: INCHIKEY MFEIKQPHQINPRI-UHFFFAOYSA-N
CH$LINK: PUBCHEM CID:10823

AC$INSTRUMENT: HITACHI M-80
AC$INSTRUMENT_TYPE: EI-B
AC$MASS_SPECTROMETRY: MS_TYPE MS
AC$MASS_SPECTROMETRY: ION_MODE POSITIVE
AC$MASS_SPECTROMETRY: IONIZATION_ENERGY 20 eV

MS$FOCUSED_ION: ION_TYPE [M]+*

PK$SPLASH: splash10-0a4l-9300000000-3d7643270a02c984a0d8
PK$NUM_PEAK: 29
PK$PEAK: m/z int. rel.int.
  27 10.53 105
  28 7.01 70
  29 9.21 92
  37 1.06 11
  38 11.72 117
  39 37.74 377
  40 2.14 21
  41 1.79 18
  50 17.33 173
  51 26.13 261
  52 8.67 87
  53 2.01 20
  54 1.96 20
  62 2.01 20
  63 8.72 87
  64 7.58 76
  65 34.24 342
  66 4.18 42
  77 10.52 105
  78 6.22 62
  79 19.43 194
  80 6.31 63
  91 1.18 12
  92 99.99 999
  93 7.22 72
  105 2.54 25
  106 44.55 446
  107 81.28 813
  108 5.82 58