ACCESSION: MSBNK-Fac_Eng_Univ_Tokyo-JP007935
RECORD_TITLE: EXO-4,11-EPOXY-TRICYCLO(4.4.1.1(2,5))DODECA-7,9-DIEN-3-YL NITRATE; EI-B; MS
DATE: 2016.01.19 (Created 2008.10.21, modified 2011.05.06)
AUTHORS: FUJISE Y, HAMAMATSU UNIV. SCHOOL OF MEDICINE
LICENSE: CC BY-NC-SA

CH$NAME: EXO-4,11-EPOXY-TRICYCLO(4.4.1.1(2,5))DODECA-7,9-DIEN-3-YL NITRATE
CH$COMPOUND_CLASS: N/A
CH$FORMULA: C12H13NO4
CH$EXACT_MASS: 235.08446
CH$SMILES: N/A
CH$IUPAC: N/A

AC$INSTRUMENT: JEOL JMS-D-300
AC$INSTRUMENT_TYPE: EI-B
AC$MASS_SPECTROMETRY: MS_TYPE MS
AC$MASS_SPECTROMETRY: ION_MODE POSITIVE
AC$MASS_SPECTROMETRY: IONIZATION_ENERGY 70 eV

MS$FOCUSED_ION: ION_TYPE [M]+*

PK$SPLASH: splash10-03fr-9100000000-fd4e0899362fdf54b03e
PK$NUM_PEAK: 40
PK$PEAK: m/z int. rel.int.
  51 2.75 28
  52 1.09 11
  53 2.5 25
  55 4.7 47
  57 3.46 35
  61 14.24 142
  62 8.3 83
  63 99.99 999
  64 2.74 27
  65 5.29 53
  66 1.48 15
  67 2.15 22
  69 1.85 19
  77 6.07 61
  78 87.02 870
  79 5.64 56
  80 3.81 38
  81 3.24 32
  82 1.31 13
  83 20.56 206
  91 19.29 193
  92 2.47 25
  103 1.98 20
  104 2.06 21
  105 2.55 26
  111 8.02 80
  115 4.87 49
  116 2.46 25
  117 5.59 56
  127 2.03 20
  128 6.79 68
  129 5.99 60
  130 2.26 23
  131 5.38 54
  133 2.29 23
  141 1.43 14
  142 0.99 10
  143 2.2 22
  190 1.31 13
  235 0.83 8