ACCESSION: MSBNK-Fac_Eng_Univ_Tokyo-JP007939
RECORD_TITLE: EXO-TRICYCLO(4.4.1.1(2,5))DODECA-3,8-DIEN-11-YL PARA-TOLENSULFONATE; EI-B; MS
DATE: 2016.01.19 (Created 2008.10.21, modified 2011.05.06)
AUTHORS: FUJISE Y, HAMAMATSU UNIV. SCHOOL OF MEDICINE
LICENSE: CC BY-NC-SA

CH$NAME: EXO-TRICYCLO(4.4.1.1(2,5))DODECA-3,8-DIEN-11-YL PARA-TOLENSULFONATE
CH$COMPOUND_CLASS: N/A
CH$FORMULA: C19H22O3S
CH$EXACT_MASS: 330.12897
CH$SMILES: N/A
CH$IUPAC: N/A

AC$INSTRUMENT: JEOL JMS-D-300
AC$INSTRUMENT_TYPE: EI-B
AC$MASS_SPECTROMETRY: MS_TYPE MS
AC$MASS_SPECTROMETRY: ION_MODE POSITIVE
AC$MASS_SPECTROMETRY: IONIZATION_ENERGY 70 eV

MS$FOCUSED_ION: ION_TYPE [M]+*

PK$SPLASH: splash10-002f-9300000000-704d434fe81308ba4fb2
PK$NUM_PEAK: 54
PK$PEAK: m/z int. rel.int.
  51 7.66 77
  52 2.38 24
  53 3.32 33
  55 1.97 20
  57 1.87 19
  61 8.54 85
  62 6.45 65
  63 59.06 591
  65 10.19 102
  66 14.54 145
  67 12.04 120
  68 1.29 13
  69 1.89 19
  70 1.64 16
  76 1.42 14
  77 19.57 196
  78 55.35 554
  79 19.87 199
  80 19.47 195
  81 3.29 33
  89 2.48 25
  90 1.43 14
  91 62.72 627
  92 99.99 999
  93 18.92 189
  102 1.42 14
  103 2.71 27
  104 13.57 136
  105 3.19 32
  107 1.51 15
  108 1.36 14
  115 14.08 141
  116 6.11 61
  117 16.07 161
  118 1.78 18
  127 3.09 31
  128 13.55 136
  129 16.55 166
  130 10.89 109
  131 2.71 27
  141 4.14 41
  142 3.14 31
  143 10.25 103
  144 1.37 14
  153 1.27 13
  155 2.42 24
  156 1.91 19
  157 2.93 29
  158 26.41 264
  159 3.5 35
  172 1.24 12
  235 1.68 17
  250 1.99 20
  252 3.27 33