ACCESSION: MSBNK-Fac_Eng_Univ_Tokyo-JP007950
RECORD_TITLE: 10-PHENYL-9,11,13-TRIAZA-TETRACYCLO(7.5.2.1(2,7).0(9,13))-3,5,14-TRIENE-10,12,16-TRIONE; CI-B; MS
DATE: 2016.01.19 (Created 2008.10.21, modified 2011.05.06)
AUTHORS: FUJISE Y, HAMAMATSU UNIV. SCHOOL OF MEDICINE
LICENSE: CC BY-NC-SA

CH$NAME: 10-PHENYL-9,11,13-TRIAZA-TETRACYCLO(7.5.2.1(2,7).0(9,13))-3,5,14-TRIENE-10,12,16-TRIONE
CH$COMPOUND_CLASS: N/A
CH$FORMULA: C19H15N3O3
CH$EXACT_MASS: 333.11134
CH$SMILES: N/A
CH$IUPAC: N/A

AC$INSTRUMENT: JEOL JMS-D-300
AC$INSTRUMENT_TYPE: CI-B
AC$MASS_SPECTROMETRY: MS_TYPE MS
AC$MASS_SPECTROMETRY: ION_MODE POSITIVE
AC$MASS_SPECTROMETRY: IONIZATION_ENERGY 200 eV

PK$SPLASH: splash10-0a4i-0900000000-a674f590825c4a26bd2b
PK$NUM_PEAK: 4
PK$PEAK: m/z int. rel.int.
  106 21.1 211
  107 0.72 7
  108 99.99 999
  109 5.95 60