ACCESSION: MSBNK-Fac_Eng_Univ_Tokyo-JP007984
RECORD_TITLE: ETHOSUXIMIDE; CI-B; MS
DATE: 2016.01.19 (Created 2008.10.21, modified 2011.05.06)
AUTHORS: HAMAMATSU UNIV. SCHOOL OF MEDICINE
LICENSE: CC BY-NC-SA

CH$NAME: ETHOSUXIMIDE
CH$NAME: 3-ETHYL-3-METHYL-2,5-PYRROLIDINEDIONE
CH$COMPOUND_CLASS: N/A
CH$FORMULA: C7H11NO2
CH$EXACT_MASS: 141.07898
CH$SMILES: CCC(C)(C1)C(=O)NC(=O)1
CH$IUPAC: InChI=1S/C7H11NO2/c1-3-7(2)4-5(9)8-6(7)10/h3-4H2,1-2H3,(H,8,9,10)
CH$LINK: INCHIKEY HAPOVYFOVVWLRS-UHFFFAOYSA-N
CH$LINK: COMPTOX DTXSID7023019

AC$INSTRUMENT: JEOL JMS-D-300
AC$INSTRUMENT_TYPE: CI-B
AC$MASS_SPECTROMETRY: MS_TYPE MS
AC$MASS_SPECTROMETRY: ION_MODE POSITIVE
AC$MASS_SPECTROMETRY: IONIZATION_ENERGY 200 eV
AC$MASS_SPECTROMETRY: REAGENT_GAS METHANE

PK$SPLASH: splash10-0006-2900000000-19e57defe9ded4ed42b4
PK$NUM_PEAK: 17
PK$PEAK: m/z int. rel.int.
  31 8.35 84
  35 1.07 11
  37 3.09 31
  42 19.72 197
  45 2.17 22
  97 1.69 17
  111 17.6 176
  112 1.02 10
  125 4.82 48
  126 1.04 10
  139 6.11 61
  140 99.99 999
  141 8.44 84
  142 1.52 15
  158 1.59 16
  233 3.79 38
  235 7.91 79