ACCESSION: MSBNK-Fac_Eng_Univ_Tokyo-JP008174
RECORD_TITLE: TRIPHENYLMETHANOL; EI-B; MS
DATE: 2016.01.19 (Created 2008.10.21, modified 2011.05.06)
AUTHORS: NARA WOMEN'S UNIVERSITY
LICENSE: CC BY-NC-SA

CH$NAME: TRIPHENYLMETHANOL
CH$NAME: TRIPHENYLCARBINOL
CH$COMPOUND_CLASS: N/A
CH$FORMULA: C19H16O
CH$EXACT_MASS: 260.12012
CH$SMILES: c(c3)ccc(c3)C(O)(c(c2)cccc2)c(c1)cccc1
CH$IUPAC: InChI=1S/C19H16O/c20-19(16-10-4-1-5-11-16,17-12-6-2-7-13-17)18-14-8-3-9-15-18/h1-15,20H
CH$LINK: CAS 76-84-6
CH$LINK: INCHIKEY LZTRCELOJRDYMQ-UHFFFAOYSA-N
CH$LINK: COMPTOX DTXSID0058803

AC$INSTRUMENT: HITACHI M-80
AC$INSTRUMENT_TYPE: EI-B
AC$MASS_SPECTROMETRY: MS_TYPE MS
AC$MASS_SPECTROMETRY: ION_MODE POSITIVE
AC$MASS_SPECTROMETRY: IONIZATION_ENERGY 70 eV

MS$FOCUSED_ION: ION_TYPE [M]+*

PK$SPLASH: splash10-06si-1940000000-2b2e3b3fdc1cd4b7f93b
PK$NUM_PEAK: 35
PK$PEAK: m/z int. rel.int.
  39 1.25 13
  50 2.06 21
  51 8.81 88
  76 1.59 16
  77 37.48 375
  78 5.34 53
  91 1.11 11
  105 87.53 875
  106 7.21 72
  115 1.45 15
  139 1 10
  152 3.99 40
  153 3.26 33
  154 50.29 503
  155 24.86 249
  156 2.84 28
  165 9.51 95
  166 2.27 23
  167 1.3 13
  181 5.59 56
  182 28.1 281
  183 99.99 999
  184 14.28 143
  185 1.36 14
  215 1.14 11
  239 1.9 19
  241 2.37 24
  242 2.58 26
  243 41.61 416
  244 10.99 110
  245 1.33 13
  259 1.99 20
  260 78.31 783
  261 16.26 163
  262 1.87 19