ACCESSION: MSBNK-Fac_Eng_Univ_Tokyo-JP008197
RECORD_TITLE: 2-BUTANONE; EI-B; MS
DATE: 2016.01.19 (Created 2008.10.21, modified 2011.05.06)
AUTHORS: MASS SPECTROSCOPY SOC. OF JAPAN (MSSJ)
LICENSE: CC BY-NC-SA

CH$NAME: 2-BUTANONE
CH$COMPOUND_CLASS: N/A
CH$FORMULA: C4H8O
CH$EXACT_MASS: 72.05751
CH$SMILES: CCC(C)=O
CH$IUPAC: InChI=1S/C4H8O/c1-3-4(2)5/h3H2,1-2H3
CH$LINK: INCHIKEY ZWEHNKRNPOVVGH-UHFFFAOYSA-N
CH$LINK: COMPTOX DTXSID3021516

AC$INSTRUMENT: HITACHI M-80
AC$INSTRUMENT_TYPE: EI-B
AC$MASS_SPECTROMETRY: MS_TYPE MS
AC$MASS_SPECTROMETRY: ION_MODE POSITIVE
AC$MASS_SPECTROMETRY: IONIZATION_ENERGY 20 eV

MS$FOCUSED_ION: ION_TYPE [M]+*

PK$SPLASH: splash10-0006-9000000000-c956d364a703ad576f74
PK$NUM_PEAK: 4
PK$PEAK: m/z int. rel.int.
  43 99.99 999
  44 3.28 33
  57 6.56 66
  72 19.67 197