ACCESSION: MSBNK-Fac_Eng_Univ_Tokyo-JP008436
RECORD_TITLE: O-ETHOXYPHENOL; EI-B; MS
DATE: 2016.01.19 (Created 2008.10.21, modified 2011.05.06)
AUTHORS: SODA AROMATIC CO., LTD.
LICENSE: CC BY-NC-SA

CH$NAME: O-ETHOXYPHENOL
CH$NAME: PYROCATECHOL MONOETHYL ETHER
CH$COMPOUND_CLASS: N/A
CH$FORMULA: C8H10O2
CH$EXACT_MASS: 138.06808
CH$SMILES: CCOc(c1)c(O)ccc1
CH$IUPAC: InChI=1S/C8H10O2/c1-2-10-8-6-4-3-5-7(8)9/h3-6,9H,2H2,1H3
CH$LINK: INCHIKEY MOEFFSWKSMRFRQ-UHFFFAOYSA-N
CH$LINK: COMPTOX DTXSID2042276

AC$INSTRUMENT: HITACHI M-80B
AC$INSTRUMENT_TYPE: EI-B
AC$MASS_SPECTROMETRY: MS_TYPE MS
AC$MASS_SPECTROMETRY: ION_MODE POSITIVE
AC$MASS_SPECTROMETRY: IONIZATION_ENERGY 70 eV

MS$FOCUSED_ION: ION_TYPE [M]+*

PK$SPLASH: splash10-03di-6900000000-3358c52c9698f851ecbb
PK$NUM_PEAK: 25
PK$PEAK: m/z int. rel.int.
  26 2.62 26
  27 14.66 147
  29 6.41 64
  38 1.64 16
  39 5.87 59
  43 1.3 13
  45 1.13 11
  50 2.77 28
  51 4.52 45
  52 5.56 56
  53 8.42 84
  54 2.22 22
  55 2.33 23
  63 4.78 48
  64 10.84 108
  65 4.04 40
  81 17.07 171
  82 3.76 38
  92 5.03 50
  95 1.22 12
  109 8.38 84
  110 99.99 999
  111 5.75 58
  138 40.99 410
  139 2.97 30