ACCESSION: MSBNK-Fac_Eng_Univ_Tokyo-JP008475
RECORD_TITLE: TETRAHYDROFURFURYL BUTYRATE; EI-B; MS
DATE: 2016.01.19 (Created 2008.10.21, modified 2011.05.06)
AUTHORS: SODA AROMATIC CO., LTD.
LICENSE: CC BY-NC-SA

CH$NAME: TETRAHYDROFURFURYL BUTYRATE
CH$COMPOUND_CLASS: N/A
CH$FORMULA: C9H16O3
CH$EXACT_MASS: 172.10994
CH$SMILES: CCCC(=O)OCC(C1)OCC1
CH$IUPAC: InChI=1S/C9H16O3/c1-2-4-9(10)12-7-8-5-3-6-11-8/h8H,2-7H2,1H3
CH$LINK: INCHIKEY DPZVDLFOAZNCBU-UHFFFAOYSA-N
CH$LINK: COMPTOX DTXSID50862877

AC$INSTRUMENT: HITACHI M-80B
AC$INSTRUMENT_TYPE: EI-B
AC$MASS_SPECTROMETRY: MS_TYPE MS
AC$MASS_SPECTROMETRY: ION_MODE POSITIVE
AC$MASS_SPECTROMETRY: IONIZATION_ENERGY 70 eV

MS$FOCUSED_ION: ION_TYPE [M]+*

PK$SPLASH: splash10-00di-9000000000-a9fd8fcc76090b5c73e9
PK$NUM_PEAK: 13
PK$PEAK: m/z int. rel.int.
  27 7.83 78
  29 3.44 34
  39 3.92 39
  41 12.38 124
  42 5.33 53
  43 32.85 329
  44 1.28 13
  55 2.3 23
  70 2.11 21
  71 99.99 999
  72 4.04 40
  84 12.58 126
  85 1.47 15