ACCESSION: MSBNK-Fac_Eng_Univ_Tokyo-JP008741
RECORD_TITLE: ETHANETHIOL; EI-B; MS
DATE: 2016.01.19 (Created 2008.10.21, modified 2011.05.06)
AUTHORS: SODA AROMATIC CO., LTD.
LICENSE: CC BY-NC-SA

CH$NAME: ETHANETHIOL
CH$COMPOUND_CLASS: N/A
CH$FORMULA: C2H6S
CH$EXACT_MASS: 62.01902
CH$SMILES: CCS
CH$IUPAC: InChI=1S/C2H6S/c1-2-3/h3H,2H2,1H3
CH$LINK: INCHIKEY DNJIEGIFACGWOD-UHFFFAOYSA-N
CH$LINK: COMPTOX DTXSID9026394

AC$INSTRUMENT: HITACHI M-80B
AC$INSTRUMENT_TYPE: EI-B
AC$MASS_SPECTROMETRY: MS_TYPE MS
AC$MASS_SPECTROMETRY: ION_MODE POSITIVE
AC$MASS_SPECTROMETRY: IONIZATION_ENERGY 70 eV

MS$FOCUSED_ION: ION_TYPE [M]+*

PK$SPLASH: splash10-004j-9000000000-0ec9d334fa1f93950072
PK$NUM_PEAK: 27
PK$PEAK: m/z int. rel.int.
  14 1.3 13
  15 2.79 28
  25 2.29 23
  26 25.49 255
  27 90.3 903
  28 42.36 424
  29 99.99 999
  30 1.64 16
  32 5.69 57
  33 11.35 114
  34 22.21 222
  35 13.62 136
  44 1.5 15
  45 29.2 292
  46 16.28 163
  47 86.2 862
  48 1.81 18
  49 2.83 28
  56 1.42 14
  57 9.15 92
  58 13.26 133
  59 9.18 92
  60 1.21 12
  61 14.55 146
  62 98.6 986
  63 4.15 42
  64 3.73 37