ACCESSION: MSBNK-Fac_Eng_Univ_Tokyo-JP008762
RECORD_TITLE: N-2-BUTENYL-N-BUTYL-3-OXOBUTANAMIDE; EI-B; MS
DATE: 2016.01.19 (Created 2008.10.21, modified 2011.05.06)
AUTHORS: TSUNODA T, FACULTY OF PHARMACEUTICAL SCIENCES, TOKUSHIMA BUNRI UNIV.
LICENSE: CC BY-NC-SA

CH$NAME: N-2-BUTENYL-N-BUTYL-3-OXOBUTANAMIDE
CH$COMPOUND_CLASS: N/A
CH$FORMULA: C12H21NO2
CH$EXACT_MASS: 211.15723
CH$SMILES: CCCCN(CC=CC)C(=O)CC(C)=O
CH$IUPAC: InChI=1S/C12H21NO2/c1-4-6-8-13(9-7-5-2)12(15)10-11(3)14/h4,6H,5,7-10H2,1-3H3/b6-4+
CH$LINK: INCHIKEY ONPFXSVFNBDDME-GQCTYLIASA-N

AC$INSTRUMENT: SHIMADZU LKB-9000B
AC$INSTRUMENT_TYPE: EI-B
AC$MASS_SPECTROMETRY: MS_TYPE MS
AC$MASS_SPECTROMETRY: ION_MODE POSITIVE
AC$MASS_SPECTROMETRY: IONIZATION_ENERGY 70 eV

MS$FOCUSED_ION: ION_TYPE [M]+*

PK$SPLASH: splash10-001l-9100000000-212771459baf10826021
PK$NUM_PEAK: 26
PK$PEAK: m/z int. rel.int.
  27 13.3 133
  29 20.3 203
  30 47.2 472
  39 13.5 135
  41 20.1 201
  42 15.8 158
  43 41.8 418
  44 7.1 71
  53 6.3 63
  54 5.1 51
  55 62.6 626
  56 10.9 109
  57 10.4 104
  68 7.1 71
  69 13.9 139
  70 18.5 185
  72 9.2 92
  82 6.1 61
  84 99.99 999
  85 12.6 126
  112 8.7 87
  126 36.8 368
  127 12.3 123
  128 6.3 63
  168 7.7 77
  212 5.1 51