ACCESSION: MSBNK-Fac_Eng_Univ_Tokyo-JP008868
RECORD_TITLE: 2,6-XYLIDINE; EI-B; MS
DATE: 2016.01.19 (Created 2008.10.21, modified 2011.05.06)
AUTHORS: TAJIMA S, GUNMA COLLEGE OF TECHNOLOGY
LICENSE: CC BY-NC-SA

CH$NAME: 2,6-XYLIDINE
CH$NAME: 2,6-DIMETHYLANILINE
CH$COMPOUND_CLASS: N/A
CH$FORMULA: C8H11N
CH$EXACT_MASS: 121.08915
CH$SMILES: Cc(c1)c(N)c(C)cc1
CH$IUPAC: InChI=1S/C8H11N/c1-6-4-3-5-7(2)8(6)9/h3-5H,9H2,1-2H3
CH$LINK: INCHIKEY UFFBMTHBGFGIHF-UHFFFAOYSA-N
CH$LINK: COMPTOX DTXSID8026307

AC$INSTRUMENT: HITACHI RMU-7M
AC$INSTRUMENT_TYPE: EI-B
AC$MASS_SPECTROMETRY: MS_TYPE MS
AC$MASS_SPECTROMETRY: ION_MODE POSITIVE
AC$MASS_SPECTROMETRY: IONIZATION_ENERGY 70 eV

MS$FOCUSED_ION: ION_TYPE [M]+*

PK$SPLASH: splash10-00di-3900000000-4aea984cccfc0b0c5460
PK$NUM_PEAK: 35
PK$PEAK: m/z int. rel.int.
  27 2.52 25
  28 2.67 27
  30 1.6 16
  39 5.34 53
  41 2.29 23
  42 2.67 27
  50 1.68 17
  51 4.2 42
  52 3.36 34
  53 4.27 43
  54 1.91 19
  58.5 2.21 22
  59.5 2.44 24
  60.5 2.37 24
  63 2.75 28
  66 1.6 16
  77 13.59 136
  78 7.33 73
  79 4.96 50
  80 2.44 24
  89 1.22 12
  91 9.16 92
  92 2.37 24
  93 3.97 40
  94 1.53 15
  103 7.33 73
  104 4.58 46
  105 2.6 26
  106 54.35 544
  107 4.81 48
  118 2.67 27
  119 2.29 23
  120 54.2 542
  121 99.99 999
  122 10.08 101